#45306 [NEW]: BBCode1.0 Compile Failure
From: zhangsilly at gmail dot com
Operating system: CentOS5.1
PHP version: 5.2.6
PHP Bug Type: Compile Failure
Bug description: BBCode1.0 Compile Failure
Description:
------------
When I Compile BBCode extension for my PHP5.26 which is compiled as a
thread safe one,it failed ,says:
/tmp/bbcode-1.0.0/php_bbcode.c: In function
'_php_bbcode_handling_content':
/tmp/bbcode-1.0.0/php_bbcode.c:90: error: too many arguments to function
'zend_is_callable'
/tmp/bbcode-1.0.0/php_bbcode.c: In function '_php_bbcode_handling_param':
/tmp/bbcode-1.0.0/php_bbcode.c:142: error: too many arguments to function
'zend_is_callable'
/tmp/bbcode-1.0.0/php_bbcode.c: In function '_php_bbcode_add_element':
/tmp/bbcode-1.0.0/php_bbcode.c:208: error: 'tsrm_ls' undeclared (first use
in this function)
/tmp/bbcode-1.0.0/php_bbcode.c:208: error: (Each undeclared identifier is
reported only once
/tmp/bbcode-1.0.0/php_bbcode.c:208: error: for each function it appears
in.)
make: *** [php_bbcode.lo] Error 1
--
Edit bug report at http://bugs.php.net/?id=45306&edit=1
--
Try a CVS snapshot (PHP 5.2): http://bugs.php.net/fix.php?id=45306&r=trysnapshot52
Try a CVS snapshot (PHP 5.3): http://bugs.php.net/fix.php?id=45306&r=trysnapshot53
Try a CVS snapshot (PHP 6.0): http://bugs.php.net/fix.php?id=45306&r=trysnapshot60
Fixed in CVS: http://bugs.php.net/fix.php?id=45306&r=fixedcvs
Fixed in release: http://bugs.php.net/fix.php?id=45306&r=alreadyfixed
Need backtrace: http://bugs.php.net/fix.php?id=45306&r=needtrace
Need Reproduce Script: http://bugs.php.net/fix.php?id=45306&r=needscript
Try newer version: http://bugs.php.net/fix.php?id=45306&r=oldversion
Not developer issue: http://bugs.php.net/fix.php?id=45306&r=support
Expected behavior: http://bugs.php.net/fix.php?id=45306&r=notwrong
Not enough info: http://bugs.php.net/fix.php?id=45306&r=notenoughinfo
Submitted twice: http://bugs.php.net/fix.php?id=45306&r=submittedtwice
register_globals: http://bugs.php.net/fix.php?id=45306&r=globals
PHP 4 support discontinued: http://bugs.php.net/fix.php?id=45306&r=php4
Daylight Savings: http://bugs.php.net/fix.php?id=45306&r=dst
IIS Stability: http://bugs.php.net/fix.php?id=45306&r=isapi
Install GNU Sed: http://bugs.php.net/fix.php?id=45306&r=gnused
Floating point limitations: http://bugs.php.net/fix.php?id=45306&r=float
No Zend Extensions: http://bugs.php.net/fix.php?id=45306&r=nozend
MySQL Configuration Error: http://bugs.php.net/fix.php?id=45306&r=mysqlcfg
Thread (2 messages)
- zhangsilly at gmail dot com