#45306 [Opn->Bgs]: BBCode1.0 Compile Failure
ID: 45306
Updated by: pajoye@php.net
Reported By: zhangsilly at gmail dot com
-Status: Open
+Status: Bogus
Bug Type: Compile Failure
Operating System: CentOS5.1
PHP Version: 5.2.6
New Comment:
Please report BBCode code there:
http://pecl.php.net/package/bbcode
Previous Comments:
------------------------------------------------------------------------
[2008-06-19 01:31:34] zhangsilly at gmail dot com
Description:
------------
When I Compile BBCode extension for my PHP5.26 which is compiled as a
thread safe one,it failed ,says:
/tmp/bbcode-1.0.0/php_bbcode.c: In function
'_php_bbcode_handling_content':
/tmp/bbcode-1.0.0/php_bbcode.c:90: error: too many arguments to
function 'zend_is_callable'
/tmp/bbcode-1.0.0/php_bbcode.c: In function
'_php_bbcode_handling_param':
/tmp/bbcode-1.0.0/php_bbcode.c:142: error: too many arguments to
function 'zend_is_callable'
/tmp/bbcode-1.0.0/php_bbcode.c: In function '_php_bbcode_add_element':
/tmp/bbcode-1.0.0/php_bbcode.c:208: error: 'tsrm_ls' undeclared (first
use in this function)
/tmp/bbcode-1.0.0/php_bbcode.c:208: error: (Each undeclared identifier
is reported only once
/tmp/bbcode-1.0.0/php_bbcode.c:208: error: for each function it appears
in.)
make: *** [php_bbcode.lo] Error 1
------------------------------------------------------------------------
--
Edit this bug report at http://bugs.php.net/?id=45306&edit=1
Thread (2 messages)