Bug #18507 Updated: Compile error during make install

From: Date: Tue, 23 Jul 2002 19:11:32 +0000
Subject: Bug #18507 Updated: Compile error during make install
References: 1  Groups: php.bugs 
Request: Send a blank email to php-bugs+get-14932@lists.php.net to get a copy of this message
ID: 18507 Updated by: sniper@php.net Reported By: jlester@structureinteractive.com -Status: Open +Status: Closed Bug Type: Compile Failure Operating System: RedHat Linux 7.2 PHP Version: 4.2.2 New Comment: This bug has been fixed in CVS. You can grab a snapshot of the CVS version at http://snaps.php.net/. In case this was a documentation problem, the fix will show up soon at http://www.php.net/manual/. In case this was a PHP.net website problem, the change will show up on the PHP.net site and on the mirror sites. Thank you for the report, and for helping us make PHP better. Previous Comments: ------------------------------------------------------------------------ [2002-07-23 14:39:28] jlester@structureinteractive.com I compiled PHP with the mysql and apxs options only. When attempting to run make install I get the following traceback: php_functions.c:93:9: missing binary operator make[3]: *** [php_functions.lo] Error 1 make[3]: Leaving directory `/usr/src/php-4.2.2/sapi/apache2filter' make[2]: *** [install-recursive] Error 1 make[2]: Leaving directory `/usr/src/php-4.2.2/sapi/apache2filter' make[1]: *** [install-recursive] Error 1 make[1]: Leaving directory `/usr/src/php-4.2.2/sapi' make: *** [install-recursive] Error 1 ------------------------------------------------------------------------ -- Edit this bug report at http://bugs.php.net/?id=18507&edit=1

« previous php.bugs (#14932) next »