Bug #18507: Compile error during make install
| From: | jlester at structureinteractive dot com | Date: | Tue, 23 Jul 2002 18:39:28 +0000 |
| Subject: | Bug #18507: Compile error during make install | ||
| Groups: | php.bugs | ||
| Request: | Send a blank email to php-bugs+get-14927@lists.php.net to get a copy of this message | ||
From: jlester@structureinteractive.com
Operating system: RedHat Linux 7.2
PHP version: 4.2.2
PHP Bug Type: Compile Failure
Bug description: Compile error during make install
I compiled PHP with the mysql and apxs options only. When attempting to run
make install I get the following traceback:
php_functions.c:93:9: missing binary operator
make[3]: *** [php_functions.lo] Error 1
make[3]: Leaving directory `/usr/src/php-4.2.2/sapi/apache2filter'
make[2]: *** [install-recursive] Error 1
make[2]: Leaving directory `/usr/src/php-4.2.2/sapi/apache2filter'
make[1]: *** [install-recursive] Error 1
make[1]: Leaving directory `/usr/src/php-4.2.2/sapi'
make: *** [install-recursive] Error 1
--
Edit bug report at http://bugs.php.net/?id=18507&edit=1
--
Fixed in CVS: http://bugs.php.net/fix.php?id=18507&r=fixedcvs
Fixed in release: http://bugs.php.net/fix.php?id=18507&r=alreadyfixed
Need backtrace: http://bugs.php.net/fix.php?id=18507&r=needtrace
Try newer version: http://bugs.php.net/fix.php?id=18507&r=oldversion
Not developer issue: http://bugs.php.net/fix.php?id=18507&r=support
Expected behavior: http://bugs.php.net/fix.php?id=18507&r=notwrong
Not enough info: http://bugs.php.net/fix.php?id=18507&r=notenoughinfo
Submitted twice: http://bugs.php.net/fix.php?id=18507&r=submittedtwice
register_globals: http://bugs.php.net/fix.php?id=18507&r=globals