#18852 [NEW]: cant compile with module fribidi

From: Date: Sun, 11 Aug 2002 10:17:43 +0000
Subject: #18852 [NEW]: cant compile with module fribidi
Groups: php.bugs 
Request: Send a blank email to php-bugs+get-16483@lists.php.net to get a copy of this message
From: miki@canaan.co.il Operating system: RedHat 7.1 PHP version: 4.2.2 PHP Bug Type: Compile Failure Bug description: cant compile with module fribidi tried to compile PHP4.2.2 with fribidi support. Version: 0.10.4 ---------------------------------------------------------- Dov Grobgeld the developer of fribidi told me: guint16 is normally defined in glib. I have no idea if they copied the necessary functionity from glib or not. Ask whoever did the port or look at the sources. ---------------------------------------------------------- Got the following error: In file included from internal_functions.c:34: /home/miki/apache2/php-4.2.2-with-freebidi/ext/fribidi/php_fribidi.h:32: parse error before `guint16' /home/miki/apache2/php-4.2.2-with-freebidi/ext/fribidi/php_fribidi.h:32: warning: no semicolon at end of struct or union /home/miki/apache2/php-4.2.2-with-freebidi/ext/fribidi/php_fribidi.h:33: warning: data definition has no type or storage class /home/miki/apache2/php-4.2.2-with-freebidi/ext/fribidi/php_fribidi.h:34: parse error before `*' /home/miki/apache2/php-4.2.2-with-freebidi/ext/fribidi/php_fribidi.h:34: warning: data definition has no type or storage class /home/miki/apache2/php-4.2.2-with-freebidi/ext/fribidi/php_fribidi.h:35: parse error before `*' /home/miki/apache2/php-4.2.2-with-freebidi/ext/fribidi/php_fribidi.h:35: warning: data definition has no type or storage class /home/miki/apache2/php-4.2.2-with-freebidi/ext/fribidi/php_fribidi.h:36: parse error before `}' /home/miki/apache2/php-4.2.2-with-freebidi/ext/fribidi/php_fribidi.h:36: warning: data definition has no type or storage class make[2]: *** [internal_functions.lo] Error 1 make[2]: Leaving directory `/home/miki/apache2/php-4.2.2-with-freebidi/main' make[1]: *** [all-recursive] Error 1 make[1]: Leaving directory `/home/miki/apache2/php-4.2.2-with-freebidi/main' make: *** [all-recursive] Error 1 -- Edit bug report at http://bugs.php.net/?id=18852&edit=1 -- Fixed in CVS: http://bugs.php.net/fix.php?id=18852&r=fixedcvs Fixed in release: http://bugs.php.net/fix.php?id=18852&r=alreadyfixed Need backtrace: http://bugs.php.net/fix.php?id=18852&r=needtrace Try newer version: http://bugs.php.net/fix.php?id=18852&r=oldversion Not developer issue: http://bugs.php.net/fix.php?id=18852&r=support Expected behavior: http://bugs.php.net/fix.php?id=18852&r=notwrong Not enough info: http://bugs.php.net/fix.php?id=18852&r=notenoughinfo Submitted twice: http://bugs.php.net/fix.php?id=18852&r=submittedtwice register_globals: http://bugs.php.net/fix.php?id=18852&r=globals

« previous php.bugs (#16483) next »