#18852 [Opn->Asn]: cant compile with module fribidi

From: Date: Wed, 14 Aug 2002 16:29:22 +0000
Subject: #18852 [Opn->Asn]: cant compile with module fribidi
References: 1  Groups: php.bugs 
Request: Send a blank email to php-bugs+get-16795@lists.php.net to get a copy of this message
ID: 18852 Updated by: kalowsky@php.net Reported By: miki@canaan.co.il -Status: Open +Status: Assigned Bug Type: Compile Failure Operating System: RedHat 7.1 PHP Version: 4.2.2 -Assigned To: +Assigned To: tal New Comment: assigning to tal Previous Comments: ------------------------------------------------------------------------ [2002-08-14 03:03:06] miki@canaan.co.il here it is: ./configure --prefix=/usr/local/php_4.2.2 --with-pgsql --with-apxs=/usr/local/apache2/bin/apxs --with-mysql=/usr/local/mysql --enable-calendar --with-gd --with-jpeg-dir --with-fribidi=/usr/local/fribidi ------------------------------------------------------------------------ [2002-08-13 20:49:37] kalowsky@php.net forgot to mark as feedback. ------------------------------------------------------------------------ [2002-08-13 20:49:14] kalowsky@php.net and you have fribidi installed? what is the path to your fribidi? also can you post a simple configure line to reproduce this? ------------------------------------------------------------------------ [2002-08-11 06:17:42] miki@canaan.co.il tried to compile PHP4.2.2 with fribidi support. Version: 0.10.4 ---------------------------------------------------------- Dov Grobgeld the developer of fribidi told me: guint16 is normally defined in glib. I have no idea if they copied the necessary functionity from glib or not. Ask whoever did the port or look at the sources. ---------------------------------------------------------- Got the following error: In file included from internal_functions.c:34: /home/miki/apache2/php-4.2.2-with-freebidi/ext/fribidi/php_fribidi.h:32: parse error before `guint16' /home/miki/apache2/php-4.2.2-with-freebidi/ext/fribidi/php_fribidi.h:32: warning: no semicolon at end of struct or union /home/miki/apache2/php-4.2.2-with-freebidi/ext/fribidi/php_fribidi.h:33: warning: data definition has no type or storage class /home/miki/apache2/php-4.2.2-with-freebidi/ext/fribidi/php_fribidi.h:34: parse error before `*' /home/miki/apache2/php-4.2.2-with-freebidi/ext/fribidi/php_fribidi.h:34: warning: data definition has no type or storage class /home/miki/apache2/php-4.2.2-with-freebidi/ext/fribidi/php_fribidi.h:35: parse error before `*' /home/miki/apache2/php-4.2.2-with-freebidi/ext/fribidi/php_fribidi.h:35: warning: data definition has no type or storage class /home/miki/apache2/php-4.2.2-with-freebidi/ext/fribidi/php_fribidi.h:36: parse error before `}' /home/miki/apache2/php-4.2.2-with-freebidi/ext/fribidi/php_fribidi.h:36: warning: data definition has no type or storage class make[2]: *** [internal_functions.lo] Error 1 make[2]: Leaving directory `/home/miki/apache2/php-4.2.2-with-freebidi/main' make[1]: *** [all-recursive] Error 1 make[1]: Leaving directory `/home/miki/apache2/php-4.2.2-with-freebidi/main' make: *** [all-recursive] Error 1 ------------------------------------------------------------------------ -- Edit this bug report at http://bugs.php.net/?id=18852&edit=1

« previous php.bugs (#16795) next »