#19126 [NEW]: Error during he operation 'make all'
| From: | fiera at promotion dot it | Date: | Tue, 27 Aug 2002 16:13:53 +0000 |
| Subject: | #19126 [NEW]: Error during he operation 'make all' | ||
| Groups: | php.bugs | ||
| Request: | Send a blank email to php-bugs+get-17945@lists.php.net to get a copy of this message | ||
From: fiera@promotion.it
Operating system: Slackware 8.1
PHP version: 4.2.2
PHP Bug Type: Compile Failure
Bug description: Error during he operation 'make all'
This isn't a bug, it's an error I receive during the
operation 'make all'.
make[3]: Entering directory
`/usr/local/php/php-4.2.2/sapi/apache2filter'
/bin/sh /usr/local/php/php-4.2.2/libtool --silent
--mode=compile gcc -I.
-I/usr/local/php/php-4.2.2/sapi/apache2filter
-I/usr/local/php/php-4.2.2/main -I/usr/local/php/php-4.2.2
-I/usr/local/apache/include
-I/usr/local/php/php-4.2.2/Zend
-I/usr/local/php/php-4.2.2/ext/mysql/libmysql
-I/usr/local/php/php-4.2.2/ext/xml/expat -D_REENTRANT
-I/usr/local/php/php-4.2.2/TSRM -DTHREAD=1 -g -O2 -pthread
-DZTS -prefer-pic -c php_functions.c
php_functions.c:93: parse error
make[3]: *** [php_functions.lo] Error 1
make[3]: Leaving directory
`/usr/local/php/php-4.2.2/sapi/apache2filter'
make[2]: *** [all-recursive] Error 1
make[2]: Leaving directory
`/usr/local/php/php-4.2.2/sapi/apache2filter'
make[1]: *** [all-recursive] Error 1
make[1]: Leaving directory `/usr/local/php/php-4.2.2/sapi'
make: *** [all-recursive] Error 1
What Can I Do? Please Help Me.
Alessandro
--
Edit bug report at http://bugs.php.net/?id=19126&edit=1
--
Try a CVS snapshot: http://bugs.php.net/fix.php?id=19126&r=trysnapshot
Fixed in CVS: http://bugs.php.net/fix.php?id=19126&r=fixedcvs
Fixed in release: http://bugs.php.net/fix.php?id=19126&r=alreadyfixed
Need backtrace: http://bugs.php.net/fix.php?id=19126&r=needtrace
Try newer version: http://bugs.php.net/fix.php?id=19126&r=oldversion
Not developer issue: http://bugs.php.net/fix.php?id=19126&r=support
Expected behavior: http://bugs.php.net/fix.php?id=19126&r=notwrong
Not enough info: http://bugs.php.net/fix.php?id=19126&r=notenoughinfo
Submitted twice: http://bugs.php.net/fix.php?id=19126&r=submittedtwice
register_globals: http://bugs.php.net/fix.php?id=19126&r=globals