#19126 [Opn->Csd]: Error during he operation 'make all'

From: Date: Tue, 27 Aug 2002 16:51:39 +0000
Subject: #19126 [Opn->Csd]: Error during he operation 'make all'
References: 1  Groups: php.bugs 
Request: Send a blank email to php-bugs+get-17949@lists.php.net to get a copy of this message
ID: 19126 Updated by: derick@php.net Reported By: fiera@promotion.it -Status: Open +Status: Closed Bug Type: Compile Failure Operating System: Slackware 8.1 PHP Version: 4.2.2 New Comment: This bug has been fixed in CVS. In case this was a PHP problem, snapshots of the sources are packaged every three hours; this change will be in the next snapshot. You can grab the snapshot at http://snaps.php.net/. In case this was a documentation problem, the fix will show up soon at http://www.php.net/manual/. In case this was a PHP.net website problem, the change will show up on the PHP.net site and on the mirror sites in short time. Thank you for the report, and for helping us make PHP better. You either need Apache 2.0.39 to use with PHP 4.2.2, or Apache 2.0.40 with a CVS snapshot. Derick Previous Comments: ------------------------------------------------------------------------ [2002-08-27 12:13:52] fiera@promotion.it This isn't a bug, it's an error I receive during the operation 'make all'. make[3]: Entering directory `/usr/local/php/php-4.2.2/sapi/apache2filter' /bin/sh /usr/local/php/php-4.2.2/libtool --silent --mode=compile gcc -I. -I/usr/local/php/php-4.2.2/sapi/apache2filter -I/usr/local/php/php-4.2.2/main -I/usr/local/php/php-4.2.2 -I/usr/local/apache/include -I/usr/local/php/php-4.2.2/Zend -I/usr/local/php/php-4.2.2/ext/mysql/libmysql -I/usr/local/php/php-4.2.2/ext/xml/expat -D_REENTRANT -I/usr/local/php/php-4.2.2/TSRM -DTHREAD=1 -g -O2 -pthread -DZTS -prefer-pic -c php_functions.c php_functions.c:93: parse error make[3]: *** [php_functions.lo] Error 1 make[3]: Leaving directory `/usr/local/php/php-4.2.2/sapi/apache2filter' make[2]: *** [all-recursive] Error 1 make[2]: Leaving directory `/usr/local/php/php-4.2.2/sapi/apache2filter' make[1]: *** [all-recursive] Error 1 make[1]: Leaving directory `/usr/local/php/php-4.2.2/sapi' make: *** [all-recursive] Error 1 What Can I Do? Please Help Me. Alessandro ------------------------------------------------------------------------ -- Edit this bug report at http://bugs.php.net/?id=19126&edit=1

« previous php.bugs (#17949) next »