#19367 [NEW]: Apache 2.0.36/Oracle 8i/PHP4.2.3 Will not compile

From: Date: Thu, 12 Sep 2002 07:10:41 +0000
Subject: #19367 [NEW]: Apache 2.0.36/Oracle 8i/PHP4.2.3 Will not compile
Groups: php.bugs 
Request: Send a blank email to php-bugs+get-19204@lists.php.net to get a copy of this message
From: gianfranco.schirra@tin.it Operating system: Solaris 8 PHP version: 4.2.3 PHP Bug Type: Compile Failure Bug description: Apache 2.0.36/Oracle 8i/PHP4.2.3 Will not compile Apache 2.0.36/Oracle 8i/PHP4.2.3 Will not compile sapi_apache2.c: In function `php_register_hook': sapi_apache2.c:567: too many arguments to function `ap_register_output_filter' sapi_apache2.c:568: too many arguments to function `ap_register_input_filter' make[3]: *** [sapi_apache2.lo] Error 1 make[3]: Leaving directory `/dati/local/src/php-4.2.3/sapi/apache2filter' make[2]: *** [all-recursive] Error 1 make[2]: Leaving directory `/dati/local/src/php-4.2.3/sapi/apache2filter' make[1]: *** [all-recursive] Error 1 make[1]: Leaving directory `/dati/local/src/php-4.2.3/sapi' make: *** [all-recursive] Error 1 -- Edit bug report at http://bugs.php.net/?id=19367&edit=1 -- Try a CVS snapshot: http://bugs.php.net/fix.php?id=19367&r=trysnapshot Fixed in CVS: http://bugs.php.net/fix.php?id=19367&r=fixedcvs Fixed in release: http://bugs.php.net/fix.php?id=19367&r=alreadyfixed Need backtrace: http://bugs.php.net/fix.php?id=19367&r=needtrace Try newer version: http://bugs.php.net/fix.php?id=19367&r=oldversion Not developer issue: http://bugs.php.net/fix.php?id=19367&r=support Expected behavior: http://bugs.php.net/fix.php?id=19367&r=notwrong Not enough info: http://bugs.php.net/fix.php?id=19367&r=notenoughinfo Submitted twice: http://bugs.php.net/fix.php?id=19367&r=submittedtwice register_globals: http://bugs.php.net/fix.php?id=19367&r=globals

« previous php.bugs (#19204) next »