#19367 [Opn->Csd]: Apache 2.0.36/Oracle 8i/PHP4.2.3 Will not compile

From: Date: Thu, 12 Sep 2002 07:13:55 +0000
Subject: #19367 [Opn->Csd]: Apache 2.0.36/Oracle 8i/PHP4.2.3 Will not compile
References: 1  Groups: php.bugs 
Request: Send a blank email to php-bugs+get-19206@lists.php.net to get a copy of this message
ID: 19367 Updated by: derick@php.net Reported By: gianfranco.schirra@tin.it -Status: Open +Status: Closed Bug Type: Compile Failure Operating System: Solaris 8 PHP Version: 4.2.3 New Comment: Upgrade to apache 2.0.40. Derick Previous Comments: ------------------------------------------------------------------------ [2002-09-12 02:10:41] gianfranco.schirra@tin.it Apache 2.0.36/Oracle 8i/PHP4.2.3 Will not compile sapi_apache2.c: In function `php_register_hook': sapi_apache2.c:567: too many arguments to function `ap_register_output_filter' sapi_apache2.c:568: too many arguments to function `ap_register_input_filter' make[3]: *** [sapi_apache2.lo] Error 1 make[3]: Leaving directory `/dati/local/src/php-4.2.3/sapi/apache2filter' make[2]: *** [all-recursive] Error 1 make[2]: Leaving directory `/dati/local/src/php-4.2.3/sapi/apache2filter' make[1]: *** [all-recursive] Error 1 make[1]: Leaving directory `/dati/local/src/php-4.2.3/sapi' make: *** [all-recursive] Error 1 ------------------------------------------------------------------------ -- Edit this bug report at http://bugs.php.net/?id=19367&edit=1

« previous php.bugs (#19206) next »