Bug #75284 [NEW]: Bigendian is not supported

From: Date: Fri, 29 Sep 2017 11:38:49 +0000
Subject: Bug #75284 [NEW]: Bigendian is not supported
Groups: php.bugs 
Request: Send a blank email to php-bugs+get-211450@lists.php.net to get a copy of this message
From: remi Operating system: GNU/Linux PHP version: 7.2.0RC3 Package: hash related Bug Type: Bug Bug description:Bigendian is not supported Description: ------------ At least on s390x and ppc64 /builddir/build/BUILD/php-7.2.0RC3/ext/hash/sha3/generic64lc/KeccakP-1600-opt64.c: In function 'KeccakP1600_AddLanes': /builddir/build/BUILD/php-7.2.0RC3/ext/hash/sha3/generic64lc/KeccakP-1600-opt64.c:158:22: warning: initialization discards 'const' qualifier from pointer target type [-Wdiscarded-qualifiers] UINT8 *curData = data; ^~~~ /builddir/build/BUILD/php-7.2.0RC3/ext/hash/sha3/generic64lc/KeccakP-1600-opt64.c: In function 'KeccakP1600_OverwriteBytesInLane': /builddir/build/BUILD/php-7.2.0RC3/ext/hash/sha3/generic64lc/KeccakP-1600-opt64.c:208:2: error: #error "Not yet implemented" #error "Not yet implemented" ^~~~~ /builddir/build/BUILD/php-7.2.0RC3/ext/hash/sha3/generic64lc/KeccakP-1600-opt64.c: In function 'KeccakP1600_OverwriteLanes': /builddir/build/BUILD/php-7.2.0RC3/ext/hash/sha3/generic64lc/KeccakP-1600-opt64.c:229:2: error: #error "Not yet implemented" #error "Not yet implemented" ^~~~~ /builddir/build/BUILD/php-7.2.0RC3/ext/hash/sha3/generic64lc/KeccakP-1600-opt64.c: In function 'KeccakP1600_OverwriteWithZeroes': /builddir/build/BUILD/php-7.2.0RC3/ext/hash/sha3/generic64lc/KeccakP-1600-opt64.c:264:2: error: #error "Not yet implemented" #error "Not yet implemented" ^~~~~ make: *** [Makefile:1073: ext/hash/sha3/generic64lc/KeccakP-1600-opt64.lo] Error 1 make: *** Waiting for unfinished jobs.... So we need to disable the new sha3 on bigendian (at least temporarily until fully implemented) -- Edit bug report at https://bugs.php.net/bug.php?id=75284&edit=1 -- Try a snapshot (PHP 5.4): https://bugs.php.net/fix.php?id=75284&r=trysnapshot54 Try a snapshot (PHP 5.5): https://bugs.php.net/fix.php?id=75284&r=trysnapshot55 Try a snapshot (trunk): https://bugs.php.net/fix.php?id=75284&r=trysnapshottrunk Fixed in SVN: https://bugs.php.net/fix.php?id=75284&r=fixed Fixed in release: https://bugs.php.net/fix.php?id=75284&r=alreadyfixed Need backtrace: https://bugs.php.net/fix.php?id=75284&r=needtrace Need Reproduce Script: https://bugs.php.net/fix.php?id=75284&r=needscript Try newer version: https://bugs.php.net/fix.php?id=75284&r=oldversion Not developer issue: https://bugs.php.net/fix.php?id=75284&r=support Expected behavior: https://bugs.php.net/fix.php?id=75284&r=notwrong Not enough info: https://bugs.php.net/fix.php?id=75284&r=notenoughinfo Submitted twice: https://bugs.php.net/fix.php?id=75284&r=submittedtwice register_globals: https://bugs.php.net/fix.php?id=75284&r=globals PHP 4 support discontinued: https://bugs.php.net/fix.php?id=75284&r=php4 Daylight Savings: https://bugs.php.net/fix.php?id=75284&r=dst IIS Stability: https://bugs.php.net/fix.php?id=75284&r=isapi Install GNU Sed: https://bugs.php.net/fix.php?id=75284&r=gnused Floating point limitations: https://bugs.php.net/fix.php?id=75284&r=float No Zend Extensions: https://bugs.php.net/fix.php?id=75284&r=nozend MySQL Configuration Error: https://bugs.php.net/fix.php?id=75284&r=mysqlcfg

« previous php.bugs (#211450) next »