Bug #80769 [Com]: Undefined symbols for architecture x86_64

From: Date: Mon, 22 Mar 2021 23:14:50 +0000
Subject: Bug #80769 [Com]: Undefined symbols for architecture x86_64
References: 1  Groups: php.bugs 
Request: Send a blank email to php-bugs+get-232928@lists.php.net to get a copy of this message
Edit report at https://bugs.php.net/bug.php?id=80769&edit=1 ID: 80769 Comment by: emmanuel dot fournier at free dot fr Reported by: emmanuel dot fournier at icoleis dot fr Summary: Undefined symbols for architecture x86_64 Status: Open Type: Bug Package: Compile Failure Operating System: MacOS High Sierra 10.13.6 PHP Version: 8.0.2 Block user comment: N Private report: N New Comment: Is there anybody here ? Previous Comments: ------------------------------------------------------------------------ [2021-03-08 16:53:19] emmanuel dot fournier at free dot fr With the last version 8.0.3, i've the same make error : --- Undefined symbols for architecture x86_64: "_php_addslashes", referenced from: _php_filter_add_slashes in sanitizing_filters.o _zif_addslashes in string.o _zif_stream_socket_client in streamsfuncs.o (maybe you meant: _php_addslashes_default, _php_addslashes_sse42 ) "_php_base64_decode_ex", referenced from: _to_zval_base64 in php_encoding.o _zif_base64_decode in base64.o _php_handle_auth_data in main.o _php_stream_url_wrap_rfc2397 in memory.o (maybe you meant: _php_base64_decode_ex_avx2, _php_base64_decode_ex_default , _php_base64_decode_ex_ssse3 ) "_php_base64_encode", referenced from: _to_xml_base64 in php_encoding.o _proxy_authentication in php_http.o _basic_authentication in php_http.o _make_http_soap_request in php_http.o _zif_base64_encode in base64.o _php_stream_url_wrap_http_ex in http_fopen_wrapper.o _php_password_bcrypt_hash in password.o ... (maybe you meant: _php_base64_encode_default, _php_base64_encode_ssse3 , _php_base64_encode_avx2 ) "_php_stripslashes", referenced from: _zif_stripslashes in string.o (maybe you meant: _php_stripslashes_sse42, _php_stripslashes_default ) ld: symbol(s) not found for architecture x86_64 clang: error: linker command failed with exit code 1 (use -v to see invocation) make: *** [libs/libphp.bundle] Error 1 --- If someone understand why this error block the compilation ?! ------------------------------------------------------------------------ [2021-02-21 12:20:44] dc dot link at yahoo dot fr It works even tough not necessarily directly. It is possible to take inspiration from homebrew for example https://github.com/Homebrew/homebrew-core/blob/master/Formula/php.rb ; I personally use a script to set all environment variables before build. ------------------------------------------------------------------------ [2021-02-19 09:48:09] emmanuel dot fournier at free dot fr No no, you're welcome ;-) i use a MacBook Pro mi-2010 with 2,4 GHz Intel Core 2 Duo (P8600). Yes, why the linker say : (maybe you meant: _php_addslashes_default, _php_addslashes_sse42 ) Like the compil create sse42, avx2, ssse3 functions versions ? ------------------------------------------------------------------------ [2021-02-19 07:58:25] dc dot link at yahoo dot fr Just out of curiosity, is it a Mac M1 (ARM64) ? ------------------------------------------------------------------------ [2021-02-18 12:38:39] emmanuel dot fournier at icoleis dot fr Description: ------------ At end of 'make', the linker exit code 1 with : --- Undefined symbols for architecture x86_64: "_php_addslashes", referenced from: _php_filter_add_slashes in sanitizing_filters.o _zif_addslashes in string.o _zif_stream_socket_client in streamsfuncs.o (maybe you meant: _php_addslashes_default, _php_addslashes_sse42 ) "_php_base64_decode_ex", referenced from: _to_zval_base64 in php_encoding.o _zif_base64_decode in base64.o _php_handle_auth_data in main.o _php_stream_url_wrap_rfc2397 in memory.o (maybe you meant: _php_base64_decode_ex_avx2, _php_base64_decode_ex_default , _php_base64_decode_ex_ssse3 ) "_php_base64_encode", referenced from: _to_xml_base64 in php_encoding.o _proxy_authentication in php_http.o _basic_authentication in php_http.o _make_http_soap_request in php_http.o _zif_base64_encode in base64.o _php_stream_url_wrap_http_ex in http_fopen_wrapper.o _php_password_bcrypt_hash in password.o ... (maybe you meant: _php_base64_encode_default, _php_base64_encode_ssse3 , _php_base64_encode_avx2 ) "_php_stripslashes", referenced from: _zif_stripslashes in string.o (maybe you meant: _php_stripslashes_sse42, _php_stripslashes_default ) ld: symbol(s) not found for architecture x86_64 clang: error: linker command failed with exit code 1 (use -v to see invocation) make: *** [libs/libphp.bundle] Error 1 --- Something change with core string functions ?! Is it missing code updates in extensions, i don't think so. ------------------------------------------------------------------------ -- Edit this bug report at https://bugs.php.net/bug.php?id=80769&edit=1

« previous php.bugs (#232928) next »