#22621 [Com]: Make exits with "No such file or directory error"
| From: | joostbaksteen at hotmail dot com | Date: | Mon, 07 Jul 2003 15:17:14 +0000 |
| Subject: | #22621 [Com]: Make exits with "No such file or directory error" | ||
| References: | 1 | Groups: | php.bugs |
| Request: | Send a blank email to php-bugs+get-43373@lists.php.net to get a copy of this message | ||
ID: 22621
Comment by: joostbaksteen at hotmail dot com
Reported By: rjhopkins at hotmail dot com
Status: Bogus
Bug Type: Compile Failure
Operating System: RH 7.2 with latest updates
PHP Version: 4.3.1
New Comment:
Had the same problem, a "make clean" solved the problem.
Previous Comments:
------------------------------------------------------------------------
[2003-06-30 11:15:26] da_narcissus at hotmail dot com
I get the same error when I try make.
My configure options are
--with-imap --with-gettext --with-mysql --with-imapssl=/usr/local/ssl
--with-xml --with-apache=/path/to/apache -enable-track-vars
I tried both the gz and bz2 versions..Both terminate with the same
error
gcc: sapi/cli/php_cli.o: No such file or directory
gcc: sapi/cli/getopt.o: No such file or directory
make: *** [sapi/cli/php] Error 1
Any help on this would be appreciated.
------------------------------------------------------------------------
[2003-03-15 06:52:33] rjhopkins at hotmail dot com
Used --without-pear option and installs ok.
------------------------------------------------------------------------
[2003-03-15 06:31:32] rjhopkins at hotmail dot com
Could possibly be a broken zip file. Downloaded the gz file a couple
of times, same error. Then tried the bz2 file and the make succeded
but the make install failed with the following error.
:
:
creating libphp4.la
(cd .libs && rm -f libphp4.la && ln -s ../libphp4.la libphp4.la)
Installing PHP SAPI module
Installing shared extensions:
/usr/local/PHP_CGI/lib/php/extensions/debug-non-zts-20020429/
Installing PEAR environment: /usr/local/PHP_CGI/lib/php/
make[1]: *** [install-pear-installer] Segmentation fault
make: *** [install-pear] Error 2
------------------------------------------------------------------------
[2003-03-10 09:41:30] sniper@php.net
There's something really broken in your system.
Or your tar.gz of PHP wasn't complete.
Or your gcc is broken. But this is definately any
bug, otherwise we'd had hundreds of reports about it
by now.
------------------------------------------------------------------------
[2003-03-10 06:25:15] rjhopkins at hotmail dot com
I've searched the internet as well as the PHP web site and found a
couple of people with the same problem but no solution.
I get no error when I configure with --with-apxs2 flag.
When I use ./configure --prefix=/usr/local/PHP_CGI
--with-mysql=/usr/local/mysql --enable-force-cgi-redirect
--enable-discard-path --enable-debug
OR just ./configure on it's own, I get an error using make.
# make
/bin/sh /home/downloads/php/php-4.3.1/libtool --mode=link gcc
-export-dynamic -g -Wall -L/usr/local/mysql/lib -R
/usr/local/mysql/lib ext/ctype/ctype.lo ext/mysql/php_mysql.lo
ext/overload/overload.lo ext/pcre/pcrelib/maketables.lo
ext/pcre/pcrelib/get.lo ext/pcre/pcrelib/study.lo
ext/pcre/pcrelib/pcre.lo ext/pcre/php_pcre.lo ext/posix/posix.lo
ext/session/session.lo ext/session/mod_files.lo ext/session/mod_mm.lo
ext/session/mod_user.lo ext/standard/array.lo ext/standard/base64.lo
ext/standard/basic_functions.lo ext/standard/browscap.lo
ext/standard/crc32.lo ext/standard/crypt.lo ext/standard/cyr_convert.lo
ext/standard/datetime.lo ext/standard/dir.lo ext/standard/dl.lo
ext/standard/dns.lo ext/standard/exec.lo ext/standard/file.lo
ext/standard/filestat.lo ext/standard/flock_compat.lo
ext/standard/formatted_print.lo ext/standard/fsock.lo
ext/standard/head.lo ext/standard/html.lo ext/standard/image.lo
ext/standard/info.lo ext/standard/iptc.lo ext/standard/lcg.lo
ext/standard/link.lo ext/standard/mail.lo ext/standard/math.lo
ext/standard/md5.lo ext/standard/metaphone.lo ext/standard/microtime.lo
ext/standard/pack.lo ext/standard/pageinfo.lo ext/standard/parsedate.lo
ext/standard/quot_print.lo ext/standard/rand.lo ext/standard/reg.lo
ext/standard/soundex.lo ext/standard/string.lo ext/standard/scanf.lo
ext/standard/syslog.lo ext/standard/type.lo ext/standard/uniqid.lo
ext/standard/url.lo ext/standard/url_scanner.lo ext/standard/var.lo
ext/standard/versioning.lo ext/standard/assert.lo
ext/standard/strnatcmp.lo ext/standard/levenshtein.lo
ext/standard/incomplete_class.lo ext/standard/url_scanner_ex.lo
ext/standard/ftp_fopen_wrapper.lo ext/standard/http_fopen_wrapper.lo
ext/standard/php_fopen_wrapper.lo ext/standard/credits.lo
ext/standard/css.lo ext/standard/var_unserializer.lo
ext/standard/ftok.lo ext/standard/aggregation.lo ext/standard/sha1.lo
ext/tokenizer/tokenizer.lo ext/xml/xml.lo ext/xml/expat/xmlparse.lo
ext/xml/expat/xmlrole.lo ext/xml/expat/xmltok.lo regex/regcomp.lo
regex/regexec.lo regex/regerror.lo regex/regfree.lo TSRM/TSRM.lo
TSRM/tsrm_strtok_r.lo TSRM/tsrm_virtual_cwd.lo main/main.lo
main/snprintf.lo main/spprintf.lo main/php_sprintf.lo main/safe_mode.lo
main/fopen_wrappers.lo main/alloca.lo main/php_ini.lo main/SAPI.lo
main/rfc1867.lo main/php_content_types.lo main/strlcpy.lo
main/strlcat.lo main/mergesort.lo main/reentrancy.lo
main/php_variables.lo main/php_ticks.lo main/streams.lo main/network.lo
main/php_open_temporary_file.lo main/php_logos.lo main/output.lo
main/memory_streams.lo main/user_streams.lo
Zend/zend_language_parser.lo Zend/zend_language_scanner.lo
Zend/zend_ini_parser.lo Zend/zend_ini_scanner.lo Zend/zend_alloc.lo
Zend/zend_compile.lo Zend/zend_constants.lo Zend/zend_dynamic_array.lo
Zend/zend_execute_API.lo Zend/zend_highlight.lo Zend/zend_llist.lo
Zend/zend_opcode.lo Zend/zend_operators.lo Zend/zend_ptr_stack.lo
Zend/zend_stack.lo Zend/zend_variables.lo Zend/zend.lo Zend/zend_API.lo
Zend/zend_extensions.lo Zend/zend_hash.lo Zend/zend_list.lo
Zend/zend_indent.lo Zend/zend_builtin_functions.lo Zend/zend_sprintf.lo
Zend/zend_ini.lo Zend/zend_qsort.lo Zend/zend_multibyte.lo
Zend/zend_execute.lo sapi/cli/php_cli.lo sapi/cli/getopt.lo
main/internal_functions_cli.lo -lmysqlclient -lz -lcrypt -lresolv -lm
-ldl -lnsl -lcrypt -o sapi/cli/php
gcc -g -Wall ext/ctype/ctype.o ext/mysql/php_mysql.o
ext/overload/overload.o ext/pcre/pcrelib/maketables.o
ext/pcre/pcrelib/get.o ext/pcre/pcrelib/study.o ext/pcre/pcrelib/pcre.o
ext/pcre/php_pcre.o ext/posix/posix.o ext/session/session.o
ext/session/mod_files.o ext/session/mod_mm.o ext/session/mod_user.o
ext/standard/array.o ext/standard/base64.o
ext/standard/basic_functions.o ext/standard/browscap.o
ext/standard/crc32.o ext/standard/crypt.o ext/standard/cyr_convert.o
ext/standard/datetime.o ext/standard/dir.o ext/standard/dl.o
ext/standard/dns.o ext/standard/exec.o ext/standard/file.o
ext/standard/filestat.o ext/standard/flock_compat.o
ext/standard/formatted_print.o ext/standard/fsock.o ext/standard/head.o
ext/standard/html.o ext/standard/image.o ext/standard/info.o
ext/standard/iptc.o ext/standard/lcg.o ext/standard/link.o
ext/standard/mail.o ext/standard/math.o ext/standard/md5.o
ext/standard/metaphone.o ext/standard/microtime.o ext/standard/pack.o
ext/standard/pageinfo.o ext/standard/parsedate.o
ext/standard/quot_print.o ext/standard/rand.o ext/standard/reg.o
ext/standard/soundex.o ext/standard/string.o ext/standard/scanf.o
ext/standard/syslog.o ext/standard/type.o ext/standard/uniqid.o
ext/standard/url.o ext/standard/url_scanner.o ext/standard/var.o
ext/standard/versioning.o ext/standard/assert.o
ext/standard/strnatcmp.o ext/standard/levenshtein.o
ext/standard/incomplete_class.o ext/standard/url_scanner_ex.o
ext/standard/ftp_fopen_wrapper.o ext/standard/http_fopen_wrapper.o
ext/standard/php_fopen_wrapper.o ext/standard/credits.o
ext/standard/css.o ext/standard/var_unserializer.o ext/standard/ftok.o
ext/standard/aggregation.o ext/standard/sha1.o
ext/tokenizer/tokenizer.o ext/xml/xml.o ext/xml/expat/xmlparse.o
ext/xml/expat/xmlrole.o ext/xml/expat/xmltok.o regex/regcomp.o
regex/regexec.o regex/regerror.o regex/regfree.o TSRM/TSRM.o
TSRM/tsrm_strtok_r.o TSRM/tsrm_virtual_cwd.o main/main.o
main/snprintf.o main/spprintf.o main/php_sprintf.o main/safe_mode.o
main/fopen_wrappers.o main/alloca.o main/php_ini.o main/SAPI.o
main/rfc1867.o main/php_content_types.o main/strlcpy.o main/strlcat.o
main/mergesort.o main/reentrancy.o main/php_variables.o
main/php_ticks.o main/streams.o main/network.o
main/php_open_temporary_file.o main/php_logos.o main/output.o
main/memory_streams.o main/user_streams.o Zend/zend_language_parser.o
Zend/zend_language_scanner.o Zend/zend_ini_parser.o
Zend/zend_ini_scanner.o Zend/zend_alloc.o Zend/zend_compile.o
Zend/zend_constants.o Zend/zend_dynamic_array.o Zend/zend_execute_API.o
Zend/zend_highlight.o Zend/zend_llist.o Zend/zend_opcode.o
Zend/zend_operators.o Zend/zend_ptr_stack.o Zend/zend_stack.o
Zend/zend_variables.o Zend/zend.o Zend/zend_API.o
Zend/zend_extensions.o Zend/zend_hash.o Zend/zend_list.o
Zend/zend_indent.o Zend/zend_builtin_functions.o Zend/zend_sprintf.o
Zend/zend_ini.o Zend/zend_qsort.o Zend/zend_multibyte.o
Zend/zend_execute.o sapi/cli/php_cli.o sapi/cli/getopt.o
main/internal_functions_cli.o -o sapi/cli/php -Wl,--export-dynamic
-L/usr/local/mysql/lib -lmysqlclient -lz -lcrypt -lresolv -lm -ldl
-lnsl -lcrypt -Wl,--rpath -Wl,/usr/local/mysql/lib
gcc: sapi/cli/php_cli.o: No such file or directory
gcc: sapi/cli/getopt.o: No such file or directory
make: *** [sapi/cli/php] Error 1
------------------------------------------------------------------------
--
Edit this bug report at http://bugs.php.net/?id=22621&edit=1