#22621 [Com]: Make exits with "No such file or directory error"

From: Date: Tue, 08 Jul 2003 05:27:16 +0000
Subject: #22621 [Com]: Make exits with "No such file or directory error"
References: 1  Groups: php.bugs 
Request: Send a blank email to php-bugs+get-43413@lists.php.net to get a copy of this message
ID: 22621 Comment by: me at shiftedphase dot com Reported By: rjhopkins at hotmail dot com Status: Bogus Bug Type: Compile Failure Operating System: RH 7.2 with latest updates PHP Version: 4.3.1 New Comment: Confirm on that 'make clean' fix. Previous Comments: ------------------------------------------------------------------------ [2003-07-07 10:17:13] joostbaksteen at hotmail dot com Had the same problem, a "make clean" solved the problem. ------------------------------------------------------------------------ [2003-06-30 11:15:26] da_narcissus at hotmail dot com I get the same error when I try make. My configure options are --with-imap --with-gettext --with-mysql --with-imapssl=/usr/local/ssl --with-xml --with-apache=/path/to/apache -enable-track-vars I tried both the gz and bz2 versions..Both terminate with the same error gcc: sapi/cli/php_cli.o: No such file or directory gcc: sapi/cli/getopt.o: No such file or directory make: *** [sapi/cli/php] Error 1 Any help on this would be appreciated. ------------------------------------------------------------------------ [2003-03-15 06:52:33] rjhopkins at hotmail dot com Used --without-pear option and installs ok. ------------------------------------------------------------------------ [2003-03-15 06:31:32] rjhopkins at hotmail dot com Could possibly be a broken zip file. Downloaded the gz file a couple of times, same error. Then tried the bz2 file and the make succeded but the make install failed with the following error. : : creating libphp4.la (cd .libs && rm -f libphp4.la && ln -s ../libphp4.la libphp4.la) Installing PHP SAPI module Installing shared extensions: /usr/local/PHP_CGI/lib/php/extensions/debug-non-zts-20020429/ Installing PEAR environment: /usr/local/PHP_CGI/lib/php/ make[1]: *** [install-pear-installer] Segmentation fault make: *** [install-pear] Error 2 ------------------------------------------------------------------------ [2003-03-10 09:41:30] sniper@php.net There's something really broken in your system. Or your tar.gz of PHP wasn't complete. Or your gcc is broken. But this is definately any bug, otherwise we'd had hundreds of reports about it by now. ------------------------------------------------------------------------ The remainder of the comments for this report are too long. To view the rest of the comments, please view the bug report online at http://bugs.php.net/22621 -- Edit this bug report at http://bugs.php.net/?id=22621&edit=1

« previous php.bugs (#43413) next »