PHP 4.0 Bug #2776: odbc compile failure while compiling with apache 1.3.9 and Solid 2.3
| From: | chrisvik at tapir dot no | Date: | Sat, 20 Nov 1999 08:26:19 +0000 |
| Subject: | PHP 4.0 Bug #2776: odbc compile failure while compiling with apache 1.3.9 and Solid 2.3 | ||
| Groups: | php.dev | ||
| Request: | Send a blank email to php-dev+get-12806@lists.php.net to get a copy of this message | ||
From: chrisvik@tapir.no
Operating system: Redhat 6.0 Solid 2.3
PHP version: 4.0 Beta 3
PHP Bug Type: Compile Failure
Bug description: odbc compile failure while compiling with apache 1.3.9 and Solid 2.3
php4b3 compiles without any warning. (configured --with-solid)
But while compiling apache 1.3.9:
gcc -O2 -DLINUX=2 -I/usr/src/php-4.0b3 -I/usr/src/php-4.0b3/libzend -I/usr/src/php-4.0b3/libzend
-I/usr/src/php-4.0b3 -DUSE_HSREGEX -DUSE_EXPAT -I./lib/expat-lite
./apaci -o httpd
buildmark.o modules.o modules/standard/libstandard.a modules/php4/libphp4.a main/libmain.a
./os/unix/libos.a ap/libap.a regex/libregex.a lib/expat-lite/libexpat.a -Lmodules/php4
-L../modules/php4 -L../../modules/php4 -lmodphp4 -ldl -lm -lresolv -lnsl -lcrypt -lgdbm -lgd -lttf
../solid/lib/bcllux23.so -lpam -lz -lm -lcrypt
modules/php4/libphp4.a(php_odbc.o): In function `php3_odbc_columnprivileges':
/usr/src/php-4.0b3/ext/odbc/php_odbc.c:2338: undefined reference to `SQLColumnPrivileges'
modules/php4/libphp4.a(php_odbc.o): In function `php3_odbc_foreignkeys':
/usr/src/php-4.0b3/ext/odbc/php_odbc.c:2423: undefined reference to `SQLForeignKeys'
modules/php4/libphp4.a(php_odbc.o): In function `php3_odbc_procedurecolumns':
/usr/src/php-4.0b3/ext/odbc/php_odbc.c:2654: undefined reference to `SQLProcedureColumns'
modules/php4/libphp4.a(php_odbc.o): In function `php3_odbc_procedures':
/usr/src/php-4.0b3/ext/odbc/php_odbc.c:2734: undefined reference to `SQLProcedures'
modules/php4/libphp4.a(php_odbc.o): In function `php3_odbc_tableprivileges':
/usr/src/php-4.0b3/ext/odbc/php_odbc.c:2981: undefined reference to `SQLTablePrivileges'
collect2: ld returned 1 exit status
make[2]: *** [target_static] Error 1
make[2]: Leaving directory `/usr/src/apache_1.3.9/src'
make[1]: *** [build-std] Error 2
make[1]: Leaving directory `/usr/src/apache_1.3.9'
make: *** [build] Error 2