PHP 4.0 Bug #2925: parsedate.c fails to compile with current CVS
| From: | danny dot heijl at cevi dot be | Date: | Mon, 06 Dec 1999 19:34:40 +0000 |
| Subject: | PHP 4.0 Bug #2925: parsedate.c fails to compile with current CVS | ||
| Groups: | php.dev | ||
| Request: | Send a blank email to php-dev+get-13477@lists.php.net to get a copy of this message | ||
From: danny.heijl@cevi.be
Operating system: RH 6.0 Linux
PHP version: 4.0 Latest CVS (06/12/1999)
PHP Bug Type: Compile Failure
Bug description: parsedate.c fails to compile with current CVS
Latest compile fails in parsedate.c :
gcc -DHAVE_CONFIG_H -I. -I. -I../.. -I../../libzend -I../.. -I../../libzend -I/home/local/include
-I/opt/informix/incl/esql -I/home/local/include/xml -I/home/local/include -D_POSIX_PTHREAD_SEMANTICS
-D_REENTRANT -O2 -mpentium -g -Wall -I/opt/informix/incl/esql -c parsedate.c -o parsedate.o
parsedate.y:804: conflicting types for `date_lex'
parsedate.y:163: previous declaration of `date_lex'
make[3]: *** [parsedate.lo] Error 1
make[3]: Leaving directory `/home/web/php/php4/ext/standard'
make[2]: *** [all-recursive] Error 1
make[2]: Leaving directory `/home/web/php/php4/ext'
make[1]: *** [all-recursive] Error 1
make[1]: Leaving directory `/home/web/php/php4'
make: *** [all-recursive-am] Error 2