PHP 4.0 Bug #3211: make failure
| From: | york1975 at 163 dot net | Date: | Fri, 14 Jan 2000 10:08:05 +0000 |
| Subject: | PHP 4.0 Bug #3211: make failure | ||
| Groups: | php.dev | ||
| Request: | Send a blank email to php-dev+get-14613@lists.php.net to get a copy of this message | ||
From: york1975@163.net
Operating system: Redhat 6.0
PHP version: 4.0 Beta 3
PHP Bug Type: Compile Failure
Bug description: make failure
# ./configure \
--with-apache=../apache_1.3.x \
--with-mysql=/path/to/mysql \
--enable-memory-limit=yes \
--enable-track-vars
# make
zend_alloc.c:148: macro `_CHECK_MEMORY_LIMIT' used with just one arg
zend_alloc.c:237: macro `_CHECK_MEMORY_LIMIT' used with just one arg
gmake[2]: *** [zend_alloc.lo] Error 1
gmake[2]: Leaving directory `/var/src/ssl/php-4.0b3/libzend'
gmake[1]: *** [all-recursive] Error 1
gmake[1]: Leaving directory `/var/src/ssl/php-4.0b3'
gmake: *** [all-recursive-am] Error 2
It seems like the configure "--enable-memory-limit=yes" cause the failure.
B.Regards,
York.
2000-01-14 PM.