PHP 4.0 Bug #5135: microtime.c
| From: | fastslack at lainucs dot com | Date: | Mon, 19 Jun 2000 22:40:04 +0000 |
| Subject: | PHP 4.0 Bug #5135: microtime.c | ||
| Groups: | php.dev | ||
| Request: | Send a blank email to php-dev+get-21781@lists.php.net to get a copy of this message | ||
From: fastslack@lainucs.com
Operating system: Linux 2.4.0-test1
PHP version: 4.0.0 Release
PHP Bug Type: Compile Failure
Bug description: microtime.c
Making all in standard
make[2]: Entering directory `/download/php-4.0.0/ext/standard'
make[3]: Entering directory `/download/php-4.0.0/ext/standard'
gcc -DHAVE_CONFIG_H -I. -I/download/php-4.0.0/ext/standard -I/download/php-4.0.
microtime.c: In function `php_if_getrusage':
microtime.c:97: storage size of `usg' isn't known
microtime.c:100: `RUSAGE_SELF' undeclared (first use in this function)
microtime.c:100: (Each undeclared identifier is reported only once
microtime.c:100: for each function it appears in.)
microtime.c:106: `RUSAGE_CHILDREN' undeclared (first use in this function)
microtime.c:110: warning: implicit declaration of function `getrusage'
microtime.c:97: warning: unused variable `usg'
make[3]: *** [microtime.lo] Error 1
make[3]: Leaving directory `/download/php-4.0.0/ext/standard'
make[2]: *** [all-recursive] Error 1
make[2]: Leaving directory `/download/php-4.0.0/ext/standard'
make[1]: *** [all-recursive] Error 1
make[1]: Leaving directory `/download/php-4.0.0/ext'
make: *** [all-recursive] Error 1
---------------------------------------------------
with Apache 1.3.12 and Linux 2.4.0-test1