Re: PHP 4.0 Bug #5326 Updated: Compile problem: undeclared identifier

From: Date: Sat, 29 Jul 2000 20:48:44 +0000
Subject: Re: PHP 4.0 Bug #5326 Updated: Compile problem: undeclared identifier
References: 1  Groups: php.dev 
Request: Send a blank email to php-dev+get-26989@lists.php.net to get a copy of this message
On Don, 27 Jul 2000, Bug Database wrote: > ID: 5326 > Updated by: waldschrott > Reported By: ralf@kuerbis.org > Status: Feedback > Bug Type: Compile Failure > Assigned To: > Comments: > > Please verify that it´s still happening using the latest version of > PHP from CVS. Now I've tried it with the CVS version of yesterday: microtime.c: In function `php_if_getrusage': microtime.c:97: storage size of `usg' isn't known microtime.c:100: `RUSAGE_SELF' undeclared (first use in this function) microtime.c:100: (Each undeclared identifier is reported only once microtime.c:100: for each function it appears in.) microtime.c:106: `RUSAGE_CHILDREN' undeclared (first use in this function) make[3]: *** [microtime.lo] Error 1 make[3]: Leaving directory `/usr/local/src/comapache/new/php4/ext/standard' make[2]: *** [all-recursive] Error 1 make[2]: Leaving directory `/usr/local/src/comapache/new/php4/ext/standard' make[1]: *** [all-recursive] Error 1 make[1]: Leaving directory `/usr/local/src/comapache/new/php4/ext' make: *** [all-recursive] Error 1 Best Regards, Ralf -- / mail:// ralf @ { kuerbis.org | globalpark.de | php-center.de } / http:// www . { kuerbis.org | globalpark.de | php-center.de } / fon:// { 0177-5262345 | 02233-793373 }

« previous php.dev (#26989) next »