Re: Re: PHP 4.0 Bug #5326 Updated: Compile problem: undeclared identifier
| From: | Rasmus Lerdorf | Date: | Mon, 31 Jul 2000 02:06:50 +0000 |
| Subject: | Re: Re: PHP 4.0 Bug #5326 Updated: Compile problem: undeclared identifier | ||
| References: | 1 | Groups: | php.dev |
| Request: | Send a blank email to php-dev+get-26994@lists.php.net to get a copy of this message | ||
> microtime.c: In function `php_if_getrusage':
> microtime.c:97: storage size of `usg' isn't known
> microtime.c:100: `RUSAGE_SELF' undeclared (first use in this function)
> microtime.c:100: (Each undeclared identifier is reported only once
> microtime.c:100: for each function it appears in.)
> microtime.c:106: `RUSAGE_CHILDREN' undeclared (first use in this
> function)
> make[3]: *** [microtime.lo] Error 1
> make[3]: Leaving directory
> `/usr/local/src/comapache/new/php4/ext/standard'
> make[2]: *** [all-recursive] Error 1
> make[2]: Leaving directory
> `/usr/local/src/comapache/new/php4/ext/standard'
> make[1]: *** [all-recursive] Error 1
> make[1]: Leaving directory `/usr/local/src/comapache/new/php4/ext'
> make: *** [all-recursive] Error 1
I bet you have upgraded your Linux kernel to one of the 2.4 kernels,
right? Please make sure you are running glibc-2.1.3 and that your
/usr/include/linux and /usr/include/asm symlinks are pointing to the right
places in your 2.4 kernel source tree.
-Rasmus