ext/standard/basic_functions.c
| From: | Mark Faine | Date: | Mon, 07 Aug 2000 16:08:44 +0000 |
| Subject: | ext/standard/basic_functions.c | ||
| Groups: | php.dev | ||
| Request: | Send a blank email to php-dev+get-28025@lists.php.net to get a copy of this message | ||
I'm having trouble with current cvs:
basic_functions.c: In function `php_rshutdown_basic':
basic_functions.c:762: `executor_globals' undeclared (first use in this
function
)
basic_functions.c:762: (Each undeclared identifier is reported only once
basic_functions.c:762: for each function it appears in.)
make[3]: *** [basic_functions.lo] Error 1
make[3]: Leaving directory `/raidb4/temp/php4/ext/standard'
make[2]: *** [all-recursive] Error 1
make[2]: Leaving directory `/raidb4/temp/php4/ext/standard'
make[1]: *** [all-recursive] Error 1
make[1]: Leaving directory `/raidb4/temp/php4/ext'
make: *** [all-recursive] Error 1
anybody know how to fix this?
-Mark