RE: PHP 4.0 Bug #4775 Updated: nsapi with NES, libstdc++ file not found on server startup
| From: | Faine, Mark | Date: | Wed, 09 Aug 2000 12:53:35 +0000 |
| Subject: | RE: PHP 4.0 Bug #4775 Updated: nsapi with NES, libstdc++ file not found on server startup | ||
| Groups: | php.dev | ||
| Request: | Send a blank email to php-dev+get-28248@lists.php.net to get a copy of this message | ||
The last I remember this has not happened the past few times I have
successfully compiled php4
I cannot verify completely that it is not happening with current cvs as I
cannot compile current cvs, for the past week or so I keep getting the same
error when compiling.
ANT -DXML_BYTE_ORDER=21 -I../TSRM -g -O2 -pthreads -c basic_functions.c
basic_functions.c: In function `php_rshutdown_basic':
basic_functions.c:762: `executor_globals' undeclared (first use in this
function
)
basic_functions.c:762: (Each undeclared identifier is reported only once
basic_functions.c:762: for each function it appears in.)
make[3]: *** [basic_functions.lo] Error 1
make[3]: Leaving directory `/raidb4/temp/php4/ext/standard'
make[2]: *** [all-recursive] Error 1
make[2]: Leaving directory `/raidb4/temp/php4/ext/standard'
make[1]: *** [all-recursive] Error 1
make[1]: Leaving directory `/raidb4/temp/php4/ext'
make: *** [all-recursive] Error 1
starbase#
While this may have nothing to do with what you are working on, at this
point I'm willing to ask everyone about it. Maybe someone will have some
insight into correcting it.
-Mark
-----Original Message-----
From: Bug Database [mailto:php-dev@lists.php.net]
Sent: Tuesday, August 08, 2000 9:39 PM
To: mark.faine@msfc.nasa.gov
Subject: PHP 4.0 Bug #4775 Updated: nsapi with NES, libstdc++ file not
found on server startup
ID: 4775
Updated by: waldschrott
Reported By: mark.faine@msfc.nasa.gov
Status: Feedback
Bug Type: Dynamic loading related
Assigned To:
Comments:
Please verify that it´s still happening using the latest version of PHP
(release 4.0.1pl2 or CVS).
Full Bug description available at: http://bugs.php.net/?id=4775