RE: PHP 4.0 Bug #4907 Updated: relocation error: symbol opinit not found
| From: | Faine, Mark | Date: | Wed, 09 Aug 2000 12:55:24 +0000 |
| Subject: | RE: PHP 4.0 Bug #4907 Updated: relocation error: symbol opinit not found | ||
| Groups: | php.dev | ||
| Request: | Send a blank email to php-dev+get-28249@lists.php.net to get a copy of this message | ||
This still happens if I compile with Oracle support, seems the opinit symbol
is in some way related to libclntsh.so which may be causing this problem.
I cannot verify that it is still happening with current cvs. This is
because I cannot compile current cvs, for the past week or so I keep getting
the same error when compiling. (Solaris 2.6, NES)
ANT -DXML_BYTE_ORDER=21 -I../TSRM -g -O2 -pthreads -c basic_functions.c
basic_functions.c: In function `php_rshutdown_basic':
basic_functions.c:762: `executor_globals' undeclared (first use in this
function
)
basic_functions.c:762: (Each undeclared identifier is reported only once
basic_functions.c:762: for each function it appears in.)
make[3]: *** [basic_functions.lo] Error 1
make[3]: Leaving directory `/raidb4/temp/php4/ext/standard'
make[2]: *** [all-recursive] Error 1
make[2]: Leaving directory `/raidb4/temp/php4/ext/standard'
make[1]: *** [all-recursive] Error 1
make[1]: Leaving directory `/raidb4/temp/php4/ext'
make: *** [all-recursive] Error 1
starbase#
While this may have nothing to do with what you are working on, at this
point I'm willing to ask everyone about it. So far no one has been able to
tell me how to correct it.
-Mark
-----Original Message-----
From: Bug Database [mailto:php-dev@lists.php.net]
Sent: Tuesday, August 08, 2000 9:45 PM
To: Mark.Faine@msfc.nasa.gov
Subject: PHP 4.0 Bug #4907 Updated: relocation error: symbol opinit not
found
ID: 4907
Updated by: waldschrott
Reported By: Mark.Faine@msfc.nasa.gov
Status: Feedback
Bug Type: Dynamic loading related
Assigned To:
Comments:
Please verify that it´s still happening using the latest version of PHP
(release 4.0.1pl2 or CVS).
Full Bug description available at: http://bugs.php.net/?id=4907