Re: current cvs: win32 apache build failure

From: Date: Thu, 14 Dec 2000 22:26:48 +0000
Subject: Re: current cvs: win32 apache build failure
References: 1  Groups: php.dev 
Request: Send a blank email to php-dev+get-41409@lists.php.net to get a copy of this message
At 20:44 14.12.2000 +0100, André Langhorst wrote:
FYI: C:\php4-sources\current\php4\sapi\apache\php_apache.c(120) : error C2065: 'sapi_globals' : nichtdeklarierter Bezeichner (non-declared identifier) C:\php4-sources\current\php4\sapi\apache\php_apache.c(120) : error C2223: Der linke Teil von '->server_context' muss auf eine Struktur/Union zeigen (left part of '->server_context' has to point to structure/union) C:\php4-sources\current\php4\sapi\apache\php_apache.c(120) : error C2198: 'ap_child_terminate' : Nicht genuegend Parameter uebergeben ('ap_child_terminate' not enough parameters passed)
should be fixed now. daniel /*-- daniel beulshausen - daniel@php4win.de using php on windows? http://www.php4win.de

« previous php.dev (#41409) next »