PHP 4.0 Bug #9636: error message
| From: | smithr at mail dot ecu dot edu | Date: | Thu, 08 Mar 2001 20:03:06 +0000 |
| Subject: | PHP 4.0 Bug #9636: error message | ||
| Groups: | php.dev | ||
| Request: | Send a blank email to php-dev+get-48307@lists.php.net to get a copy of this message | ||
From: smithr@mail.ecu.edu
Operating system: Solaris 8
PHP version: 4.0.4pl1
PHP Bug Type: Compile Failure
Bug description: error message
For Netscape Enterprise Server configuration:
After installing all the necessary packages and running
"./configure --with-mysql=/usr/local/mysql --with-nsapi=
/opt/netscape/suitespot --enable-track-vars --enable-libgcc"
When attempting to run "make" I get the following:
# make
Making all in Zend
Making all in Zend
/bin/sh ../libtool --silent --mode=compile c++ -DHAVE_CONFIG_H -I. -I. -I../main
-D_POSIX_PTHREAD_SEMANTICS -D_POSIX_PTHREAD_SEMANTICS -D_REENTRANT -DXML_BYTE
_ORDER=21 -I../TSRM -g -O2 -pthreads -c zend_language_scanner_cc.cc
In file included from zend_language_scanner_cc.cc:2571:
zend_operators.h: In function `int is_numeric_string(char *, int, long int *, do
uble *)':
zend_operators.h:84: implicit declaration of function `int finite(...)'
make[1]: *** [zend_language_scanner_cc.lo] Error 1
make[1]: Leaving directory `/usr/local/php-4.0.4pl1/Zend'
make: *** [all-recursive] Error 1
#
Running gcc-2.95_2
Thanks,
Bob Smith
Computer Systems Administrator
East Carolina University
smithr@mail.ecu.edu
(252) 328-0421
--
Edit Bug report at: http://bugs.php.net/?id=9636&edit=1