Bug #12397: Error in /usr/src/php-4.0.6/ext/standard/filestat.c:157

From: Date: Thu, 26 Jul 2001 13:09:43 +0000
Subject: Bug #12397: Error in /usr/src/php-4.0.6/ext/standard/filestat.c:157
Groups: php.dev 
Request: Send a blank email to php-dev+get-61057@lists.php.net to get a copy of this message
From: admin@lenta.co.il Operating system: Slack 7, 2.2.10, gcc 2.7.2.3 PHP version: 4.0.6 PHP Bug Type: Compile Failure Bug description: Error in /usr/src/php-4.0.6/ext/standard/filestat.c:157 gcc -I. -I/usr/src/php-4.0.6/ext/standard -I/usr/src/php-4.0.6/main -I/usr/src/php-4.0.6 -I/usr/src/apache_1.3.20/src/include -I/usr/src/apache_1.3.20/src/os/unix -I/usr/src/php-4.0.6/Zend -I/usr/src/gd1.3 -I/usr/local/mysql/include/mysql -I/usr/src/php-4.0.6/ext/xml/expat/xmltok -I/usr/src/php-4.0.6/ext/xml/expat/xmlparse -I/usr/src/php-4.0.6/TSRM -DSUPPORT_UTF8 -DXML_BYTE_ORDER=12 -g -O2 -c filestat.c && touch filestat.lo filestat.c: In function `php_if_diskfreespace': filestat.c:157: storage size of `buf' isn't known make[3]: *** [filestat.lo] Error 1 make[3]: Leaving directory `/usr/src/php-4.0.6/ext/standard' make[2]: *** [all-recursive] Error 1 make[2]: Leaving directory `/usr/src/php-4.0.6/ext/standard' make[1]: *** [all-recursive] Error 1 make[1]: Leaving directory `/usr/src/php-4.0.6/ext' make: *** [all-recursive] Error 1 -- Edit bug report at: http://bugs.php.net/?id=12397&edit=1

« previous php.dev (#61057) next »