Bug #12397 Updated: Error in /usr/src/php-4.0.6/ext/standard/filestat.c:157

From: Date: Sat, 18 Aug 2001 07:58:45 +0000
Subject: Bug #12397 Updated: Error in /usr/src/php-4.0.6/ext/standard/filestat.c:157
References: 1  Groups: php.dev 
Request: Send a blank email to php-dev+get-63576@lists.php.net to get a copy of this message
ID: 12397 Updated by: sniper Reported By: admin@lenta.co.il Old Status: Open Status: Closed Bug Type: Compile Failure Operating System: Slack 7, 2.2.10, gcc 2.7.2.3 PHP Version: 4.0.6 New Comment: Fixed in CVS and in 4.0.7-RC1. http://www.php.net/~zeev/php-4.0.7-latest.tar.gz --Jani Previous Comments: ------------------------------------------------------------------------ [2001-07-26 09:09:43] admin@lenta.co.il gcc -I. -I/usr/src/php-4.0.6/ext/standard -I/usr/src/php-4.0.6/main -I/usr/src/php-4.0.6 -I/usr/src/apache_1.3.20/src/include -I/usr/src/apache_1.3.20/src/os/unix -I/usr/src/php-4.0.6/Zend -I/usr/src/gd1.3 -I/usr/local/mysql/include/mysql -I/usr/src/php-4.0.6/ext/xml/expat/xmltok -I/usr/src/php-4.0.6/ext/xml/expat/xmlparse -I/usr/src/php-4.0.6/TSRM -DSUPPORT_UTF8 -DXML_BYTE_ORDER=12 -g -O2 -c filestat.c && touch filestat.lo filestat.c: In function `php_if_diskfreespace': filestat.c:157: storage size of `buf' isn't known make[3]: *** [filestat.lo] Error 1 make[3]: Leaving directory `/usr/src/php-4.0.6/ext/standard' make[2]: *** [all-recursive] Error 1 make[2]: Leaving directory `/usr/src/php-4.0.6/ext/standard' make[1]: *** [all-recursive] Error 1 make[1]: Leaving directory `/usr/src/php-4.0.6/ext' make: *** [all-recursive] Error 1 ------------------------------------------------------------------------ Edit this bug report at http://bugs.php.net/?id=12397&edit=1

« previous php.dev (#63576) next »