Re: curl compiler failed

From: Date: Mon, 24 Sep 2001 18:39:57 +0000
Subject: Re: curl compiler failed
References: 1  Groups: php.dev 
Request: Send a blank email to php-dev+get-66485@lists.php.net to get a copy of this message
On Mon, 24 Sep 2001, Holger Schopohl wrote: > Hi, > > in the current cvs tree: > > curl.c: In function `zm_startup_curl': > curl.c:196: `CURLINFO_SSL_VERIFY_RESULT' undeclared (first use in this > function) > curl.c:196: (Each undeclared identifier is reported only once > curl.c:196: for each function it appears in.) > curl.c: In function `zif_curl_getinfo': > curl.c:923: `CURLINFO_SSL_VERIFY_RESULT' undeclared (first use in this > function) > make[3]: *** [curl.slo] Error 1 > make[3]: Leaving directory `/usr/src/php4/ext/curl' > make[2]: *** [all-recursive] Error 1 > make[2]: Leaving directory `/usr/src/php4/ext/curl' > make[1]: *** [all-recursive] Error 1 > make[1]: Leaving directory `/usr/src/php4/ext' > make: *** [all-recursive] Error 1 > > hmm, > Try latest cvs with one of the curl pre-releases (the latest pre release should work fine). -Sterling

« previous php.dev (#66485) next »