PHP4 Bug #1816: cat't compile apache
| From: | talespin at kebi dot com | Date: | Thu, 22 Jul 1999 00:56:38 +0000 |
| Subject: | PHP4 Bug #1816: cat't compile apache | ||
| Groups: | php.dev | ||
| Request: | Send a blank email to php-dev+get-8936@lists.php.net to get a copy of this message | ||
From: talespin@kebi.com
Operating system: ultra linux (ultra sprac)
PHP version: 4.0 Beta 1
PHP Bug Type: Installation problem
Bug description: cat't compile apache
apache make outout
--------------------------------------------------------
===> src
make[1]: Entering directory `/root/apache_1.3.6'
make[2]: Entering directory `/root/apache_1.3.6/src'
===> src/regex
make[3]: Nothing to be done for `all'.
<=== src/regex
===> src/os/unix
gcc -c -I../../os/unix -I../../include -DLINUX=2 -I/root/php-4.0b1 -I/root/php-4.0b1/libzend
-I/root/php-4.0b1/libzend -I/root/php-4.0b1 -DUSE_HSREGEX
../../apaci os.c
gcc -c -I../../os/unix -I../../include -DLINUX=2 -I/root/php-4.0b1 -I/root/php-4.0b1/libzend
-I/root/php-4.0b1/libzend -I/root/php-4.0b1 -DUSE_HSREGEX ../../apaci os-inline.c
rm -f libos.a
ar cr libos.a os.o os-inline.o
ranlib libos.a
<=== src/os/unix
===> src/ap
gcc -c -I../os/unix -I../include -DLINUX=2 -I/root/php-4.0b1 -I/root/php-4.0b1/libzend
-I/root/php-4.0b1/libzend -I/root/php-4.0b1 -DUSE_HSREGEX ../apaci ap_execve.c
gcc -c -I../os/unix -I../include -DLINUX=2 -I/root/php-4.0b1 -I/root/php-4.0b1/libzend
-I/root/php-4.0b1/libzend -I/root/php-4.0b1 -DUSE_HSREGEX ../apaci ap_cpystrn.c
gcc -c -I../os/unix -I../include -DLINUX=2 -I/root/php-4.0b1 -I/root/php-4.0b1/libzend
-I/root/php-4.0b1/libzend -I/root/php-4.0b1 -DUSE_HSREGEX ../apaci ap_signal.c
gcc -c -I../os/unix -I../include -DLINUX=2 -I/root/php-4.0b1 -I/root/php-4.0b1/libzend
-I/root/php-4.0b1/libzend -I/root/php-4.0b1 -DUSE_HSREGEX ../apaci ap_slack.c
gcc -c -I../os/unix -I../include -DLINUX=2 -I/root/php-4.0b1 -I/root/php-4.0b1/libzend
-I/root/php-4.0b1/libzend -I/root/php-4.0b1 -DUSE_HSREGEX ../apaci ap_snprintf.c
gcc -c -I../os/unix -I../include -DLINUX=2 -I/root/php-4.0b1 -I/root/php-4.0b1/libzend
-I/root/php-4.0b1/libzend -I/root/php-4.0b1 -DUSE_HSREGEX ../apaci ap_fnmatch.c
gcc -c -I../os/unix -I../include -DLINUX=2 -I/root/php-4.0b1 -I/root/php-4.0b1/libzend
-I/root/php-4.0b1/libzend -I/root/php-4.0b1 -DUSE_HSREGEX ../apaci ap_md5c.c
rm -f libap.a
ar cr libap.a ap_execve.o ap_cpystrn.o ap_signal.o ap_slack.o ap_snprintf.o ap_fnmatch.o ap_md5c.o
ranlib libap.a
<=== src/ap
===> src/main
gcc -c -I../os/unix -I../include -DLINUX=2 -I/root/php-4.0b1 -I/root/php-4.0b1/libzend
-I/root/php-4.0b1/libzend -I/root/php-4.0b1 -DUSE_HSREGEX ../apaci gen_test_char.c
gcc -DLINUX=2 -I/root/php-4.0b1 -I/root/php-4.0b1/libzend -I/root/php-4.0b1/libzend
-I/root/php-4.0b1 -DUSE_HSREGEX ../apaci -o gen_test_char gen_test_char.o
-Lmodules/php4 -L../modules/php4 -L../../modules/php4 -lmodphp4 -L/root/php-4.0b1/ext/pcre/pcrelib
-lpcre -L/root/php-4.0b1/regex -lregex -lgdbm -L/usr/local/lib/mysql -lmysqlclient -lpam -ldl
-lttf -lgd -lm -lcrypt -lnsl -lresolv -rdynamic -lm -lcrypt
./gen_test_char >test_char.h
make[2]: Leaving directory `/root/apache_1.3.6/src'
make[1]: Leaving directory `/root/apache_1.3.6'
make[3]: *** [util.o] Error 1make[2]: *** [subdirs] Error 1
make[2]: Leaving directory `/root/apache_1.3.6/src'
make[1]: *** [build-std] Error 2make[1]: Leaving directory `/root/apache_1.3.6'
make: *** [build] Error 2
--------------------------------------------------