compile error?!?
| From: | Kurth Bemis | Date: | Tue, 17 Oct 2000 21:48:01 +0000 |
| Subject: | compile error?!? | ||
| Groups: | php.general | ||
| Request: | Send a blank email to php-general+get-20718@lists.php.net to get a copy of this message | ||
i have never had a problem compiling php...until now...
i configure php4.0.3pl1 with ./configure --with-apache=../apache_1.3.14 --with-mysql=/usr/local/mysql --without-gd
-------------snip--------------
-o httpd buildmark.o modules.o modules/standard/libstandard.a modules/php4/libphp4.a main/libmain.a ./os/unix/libos.a ap/libap.a lib/expat-lite/libexpat.a -Wl,-rpath,/usr/local/mysql/lib/mysql -rdynamic -L/usr/local/mysql/lib/mysql -Lmodules/php4 -L../modules/php4 -L../../modules/php4 -lmodphp4 -lmysqlclient -lresolv -lm -lcrypt -lnsl -lresolv -lm -lcrypt
modules/php4/libphp4.a(zend_extensions.o): In function `zend_extension_startup':
/root/php-4.0.3pl1/Zend/zend_extensions.c:146: undefined reference to `DL_UNLOAD'
make[2]: *** [target_static] Error 1
make[2]: Leaving directory `/root/apache_1.3.14/src'
make[1]: *** [build-std] Error 2
make[1]: Leaving directory `/root/apache_1.3.14'
make: *** [build] Error 2
usa:root[~/apache_1.3.14]$
-------------snip--------------
that happens when i do a make in ~/apache_1.3.14
what gives?
~kurth
Kurth Bemis - Network/Systems Administrator, USAExpress.net/Ozone Computer
There is no sin except stupidity. -- Oscar Wilde
kurth@usaexpress.net | http://www.usaexpress.net/kurth
PGP key available - http://www.usaexpress.net/kurth/pgp
Fight Weak Encryption! Donate your wasted CPU cycles to Distributed.net (http://www.distributed.net)