make error

From: Date: Tue, 09 Jan 2001 16:12:22 +0000
Subject: make error
References: 1  Groups: php.install 
Request: Send a blank email to php-install+get-1518@lists.php.net to get a copy of this message
crotime.c && touch microtime.lo microtime.c: In function `php_if_getrusage': microtime.c:97: storage size of `usg' isn't known microtime.c:100: `RUSAGE_SELF' undeclared (first use in this function) microtime.c:100: (Each undeclared identifier is reported only once microtime.c:100: for each function it appears in.) microtime.c:106: `RUSAGE_CHILDREN' undeclared (first use in this function) make[3]: *** [microtime.lo] Error 1 make[3]: Leaving directory `/usr/local/php-4.0.4/ext/standard' make[2]: *** [all-recursive] Error 1 make[2]: Leaving directory `/usr/local/php-4.0.4/ext/standard' make[1]: *** [all-recursive] Error 1 make[1]: Leaving directory `/usr/local/php-4.0.4/ext' make: *** [all-recursive] Error 1 Commad I used to ./configure was ./configure --with-mysql --with-apache=../apache_1.3.14 --enable-track-vars I have mysql installed to /usr/local/mysql Could someone please help me to fix this error, its php-4.0.4 / apache_1.3.14 / mysql-3.23.30-gamma on Linux RedHat 6.1 Kernel-2.3.50 Thanks Regards Chris Kay

« previous php.install (#1518) next »