Re: Install Problems

From: Date: Wed, 11 Oct 2000 18:45:45 +0000
Subject: Re: Install Problems
References: 1  Groups: php.install 
Request: Send a blank email to php-install+get-266@lists.php.net to get a copy of this message
I am getting the exact same 'gd' errors on my redhat 6.2 boxes, two of them. I can compile 4.0.1pl2 just fine, but 4.0.2 bombs with the gd errors. I would love to know what to do to fix it..... Jon ----- Original Message ----- From: "Chris Andrew" <candrew@oxspring.com> To: <php-install@lists.php.net> Sent: Wednesday, October 11, 2000 11:03 AM Subject: [PHP-INST] Install Problems > Hi, > > System: RedHat 6.1 on i386 > > After configuring php4 with the following: > ./configure --with-ldap=/usr --with-mysql=/usr/local/mysql --with-apache=../ > apache_1.3.12 --enable-track-vars > > and then running 'make', I always end up with this: > > gd.c: In function `php_if_imagecreatefromgif': > gd.c:500: `gdImageCreateFromGif' undeclared (first use in this function) > gd.c:500: (Each undeclared identifier is reported only once > gd.c:500: for each function it appears in.) > gd.c: In function `php_if_imagegif': > gd.c:657: `gdImageGif' undeclared (first use in this function) > make[3]: *** [gd.lo] Error 1 > make[3]: Leaving directory `/usr/src/redhat/SOURCES/php-4.0.2/ext/gd' > make[2]: *** [all-recursive] Error 1 > make[2]: Leaving directory `/usr/src/redhat/SOURCES/php-4.0.2/ext/gd' > make[1]: *** [all-recursive] Error 1 > make[1]: Leaving directory `/usr/src/redhat/SOURCES/php-4.0.2/ext' > make: *** [all-recursive] Error 1 > > I have also been having problems issuing "rpm --recompile > <any.src.rpm.file>" so am wondering if I have a compiler problem? > > Any Ideas? > > Thanks, > Chris > > > -- > PHP Install Mailing List (http://www.php.net/) > To unsubscribe, e-mail: php-install-unsubscribe@lists.php.net > For additional commands, e-mail: php-install-help@lists.php.net > To contact the list administrators, e-mail: php-list-admin@lists.php.net >

« previous php.install (#266) next »