Wierd Compile error!

From: Date: Mon, 13 Nov 2000 14:34:54 +0000
Subject: Wierd Compile error!
Groups: php.install 
Request: Send a blank email to php-install+get-753@lists.php.net to get a copy of this message
Hey dudes =) I do a ./configure --with-apache=/apache-dir --enable-track-vars when this is done I do a make then something wierd happens! No one I know have ever seen it! ..................... -I. -I/tmp/php-4.0.3pl1/ext/standard -I/tmp/php-4.0.3pl1 -I/tmp/php-4.0.3pl1/main -I/tmp/apache_1.3.14//src/include -I/tmp/apache_1.3.14//src/os/unix -I/tmp/php-4.0.3pl1/Zend -I/tmp/php-4.0.3pl1 -I/tmp/php-4.0.3pl1/ext/mysql/libmysql -I/tmp/php-4.0.3pl1/ext/xml/expat/xmltok -I/tmp/php-4.0.3pl1/ext/xml/expat/xmlparse -I/tmp/php-4.0.3pl1/TSRM -DXML_BYTE_ORDER=12 -g -O2 -c microtime.c && touch microtime.lo microtime.c: In function `php_if_getrusage': microtime.c:97: storage size of `usg' isn't known microtime.c:100: `RUSAGE_SELF' undeclared (first use in this function) microtime.c:100: (Each undeclared identifier is reported only once microtime.c:100: for each function it appears in.) microtime.c:106: `RUSAGE_CHILDREN' undeclared (first use in this function) make[3]: *** [microtime.lo] Error 1 make[3]: Leaving directory `/tmp/php-4.0.3pl1/ext/standard' make[2]: *** [all-recursive] Error 1 make[2]: Leaving directory `/tmp/php-4.0.3pl1/ext/standard' make[1]: *** [all-recursive] Error 1 make[1]: Leaving directory `/tmp/php-4.0.3pl1/ext' make: *** [all-recursive] Error 1 and this is where it ends! I really need help here... my system is RedHat linux 6.0 I am not subscribed to this list so please cc to mbp@nerdheaven.dk -- Morten Bønløkke Post, 5750 Ringe, Denmark. @: mbp@nerdheaven.dk * Web: Http://www.partycrackers.dk

« previous php.install (#753) next »