note 107126 added to svn.installation

From: Date: Mon, 09 Jan 2012 18:40:48 +0000
Subject: note 107126 added to svn.installation
Groups: php.notes 
Request: Send a blank email to php-notes+get-185488@lists.php.net to get a copy of this message
getting this error when i ran pecl install svn. /var/tmp/svn/svn.c:3818: error: expected '=', ',', ';', 'asm' or '__attribute__' before '{' token /var/tmp/svn/svn.c:3838: error: old-style parameter declarations in prototyped function definition /usr/include/apr-1/apr_errno.h:52: error: parameter name omitted /var/tmp/svn/svn.c:3838: error: expected '{' at end of input make: *** [svn.lo] Error 1 ERROR: `make' failed ---- Server IP: 69.147.83.197 Probable Submitter: 72.5.115.169 ---- Manual Page -- http://www.php.net/manual/en/svn.installation.php Edit -- https://master.php.net/note/edit/107126 Del: integrated -- https://master.php.net/note/delete/107126/integrated Del: useless -- https://master.php.net/note/delete/107126/useless Del: bad code -- https://master.php.net/note/delete/107126/bad+code Del: spam -- https://master.php.net/note/delete/107126/spam Del: non-english -- https://master.php.net/note/delete/107126/non-english Del: in docs -- https://master.php.net/note/delete/107126/in+docs Del: other reasons-- https://master.php.net/note/delete/107126 Reject -- https://master.php.net/note/reject/107126 Search -- https://master.php.net/manage/user-notes.php

« previous php.notes (#185488) next »