note 107126 rejected from svn.installation by danbrown

From: Date: Mon, 09 Jan 2012 19:03:27 +0000
Subject: note 107126 rejected from svn.installation by danbrown
References: 1  Groups: php.notes 
Request: Send a blank email to php-notes+get-185489@lists.php.net to get a copy of this message
Note Submitter: milkygto at gmail dot com ---- getting this error when i ran pecl install svn. /var/tmp/svn/svn.c:3818: error: expected '=', ',', ';', 'asm' or '__attribute__' before '{' token /var/tmp/svn/svn.c:3838: error: old-style parameter declarations in prototyped function definition /usr/include/apr-1/apr_errno.h:52: error: parameter name omitted /var/tmp/svn/svn.c:3838: error: expected '{' at end of input make: *** [svn.lo] Error 1 ERROR: `make' failed

« previous php.notes (#185489) next »