Re: Re: PEAR 1.9 release

From: Date: Sat, 22 Aug 2009 13:43:54 +0000
Subject: Re: Re: PEAR 1.9 release
References: 1 2  Groups: php.pear.qa 
Request: Send a blank email to pear-qa+get-5442@lists.php.net to get a copy of this message
My results testing against pear-core SVN this morning: PHP 5.3.0: TOTAL TIME: 03:02 672 PASSED TESTS 16 SKIPPED TESTS 13 FAILED TESTS: /home/ashnazg/Public/workspace/pearcore-tests/PEAR_Command_Install/upgrade/test_bug16046.phpt /home/ashnazg/Public/workspace/pearcore-tests/PEAR_Command_Remote/list-all/test_bug4072.phpt /home/ashnazg/Public/workspace/pearcore-tests/PEAR_Command_Remote/list-all/test_rest.phpt /home/ashnazg/Public/workspace/pearcore-tests/PEAR_Command_Remote/list-all/test_rest_fail.phpt /home/ashnazg/Public/workspace/pearcore-tests/PEAR_Command_Remote/list-upgrades/test.phpt /home/ashnazg/Public/workspace/pearcore-tests/PEAR_Command_Remote/remote-list/test.phpt /home/ashnazg/Public/workspace/pearcore-tests/PEAR_Command_Remote/search/test.phpt /home/ashnazg/Public/workspace/pearcore-tests/PEAR_RunTest/test_bug10092cookie.phpt /home/ashnazg/Public/workspace/pearcore-tests/PEAR_RunTest/test_bug10092get.phpt /home/ashnazg/Public/workspace/pearcore-tests/PEAR_RunTest/test_bug10092post.phpt /home/ashnazg/Public/workspace/pearcore-tests/PEAR_RunTest/test_bug10092post_raw1.phpt /home/ashnazg/Public/workspace/pearcore-tests/PEAR_RunTest/test_bug10092post_raw2.phpt /home/ashnazg/Public/workspace/pearcore-tests/PEAR_RunTest/test_bug10092upload.phpt PHP 5.2.10: TOTAL TIME: 03:06 672 PASSED TESTS 16 SKIPPED TESTS 13 FAILED TESTS: /home/ashnazg/Public/workspace/pearcore-tests/PEAR_Command_Install/upgrade/test_bug16046.phpt /home/ashnazg/Public/workspace/pearcore-tests/PEAR_Command_Remote/list-all/test_bug4072.phpt /home/ashnazg/Public/workspace/pearcore-tests/PEAR_Command_Remote/list-all/test_rest.phpt /home/ashnazg/Public/workspace/pearcore-tests/PEAR_Command_Remote/list-all/test_rest_fail.phpt /home/ashnazg/Public/workspace/pearcore-tests/PEAR_Command_Remote/list-upgrades/test.phpt /home/ashnazg/Public/workspace/pearcore-tests/PEAR_Command_Remote/remote-list/test.phpt /home/ashnazg/Public/workspace/pearcore-tests/PEAR_Command_Remote/search/test.phpt /home/ashnazg/Public/workspace/pearcore-tests/PEAR_RunTest/test_bug10092cookie.phpt /home/ashnazg/Public/workspace/pearcore-tests/PEAR_RunTest/test_bug10092get.phpt /home/ashnazg/Public/workspace/pearcore-tests/PEAR_RunTest/test_bug10092post.phpt /home/ashnazg/Public/workspace/pearcore-tests/PEAR_RunTest/test_bug10092post_raw1.phpt /home/ashnazg/Public/workspace/pearcore-tests/PEAR_RunTest/test_bug10092post_raw2.phpt /home/ashnazg/Public/workspace/pearcore-tests/PEAR_RunTest/test_bug10092upload.phpt PHP 5.1.6: TOTAL TIME: 03:17 672 PASSED TESTS 16 SKIPPED TESTS 14 FAILED TESTS: /home/ashnazg/Public/workspace/pearcore-tests/PEAR_Command_Install/upgrade/test_bug16046.phpt /home/ashnazg/Public/workspace/pearcore-tests/PEAR_Command_Remote/list-all/test_bug4072.phpt /home/ashnazg/Public/workspace/pearcore-tests/PEAR_Command_Remote/list-all/test_rest.phpt /home/ashnazg/Public/workspace/pearcore-tests/PEAR_Command_Remote/list-all/test_rest_fail.phpt /home/ashnazg/Public/workspace/pearcore-tests/PEAR_Command_Remote/list-upgrades/test.phpt /home/ashnazg/Public/workspace/pearcore-tests/PEAR_Command_Remote/remote-list/test.phpt /home/ashnazg/Public/workspace/pearcore-tests/PEAR_Command_Remote/search/test.phpt /home/ashnazg/Public/workspace/pearcore-tests/PEAR_Registry/api1_1/test_hasWriteAccess.phpt /home/ashnazg/Public/workspace/pearcore-tests/PEAR_RunTest/test_bug10092cookie.phpt /home/ashnazg/Public/workspace/pearcore-tests/PEAR_RunTest/test_bug10092get.phpt /home/ashnazg/Public/workspace/pearcore-tests/PEAR_RunTest/test_bug10092post.phpt /home/ashnazg/Public/workspace/pearcore-tests/PEAR_RunTest/test_bug10092post_raw1.phpt /home/ashnazg/Public/workspace/pearcore-tests/PEAR_RunTest/test_bug10092post_raw2.phpt /home/ashnazg/Public/workspace/pearcore-tests/PEAR_RunTest/test_bug10092upload.phpt PHP 5.0.5: *** something's very wrong here... all tests are failing... I'll revisit my setup here and retry these later today *** PHP 4.4.9: TOTAL TIME: 02:33 669 PASSED TESTS 22 SKIPPED TESTS 11 FAILED TESTS: /home/ashnazg/Public/workspace/pearcore-tests/PEAR_Command_Install/upgrade/test_bug16046.phpt /home/ashnazg/Public/workspace/pearcore-tests/PEAR_Command_Remote/list-all/test_bug4072.phpt /home/ashnazg/Public/workspace/pearcore-tests/PEAR_Command_Remote/list-all/test_rest.phpt /home/ashnazg/Public/workspace/pearcore-tests/PEAR_Command_Remote/list-all/test_rest_fail.phpt /home/ashnazg/Public/workspace/pearcore-tests/PEAR_Command_Remote/list-upgrades/test.phpt /home/ashnazg/Public/workspace/pearcore-tests/PEAR_Command_Remote/remote-list/test.phpt /home/ashnazg/Public/workspace/pearcore-tests/PEAR_Command_Remote/search/test.phpt /home/ashnazg/Public/workspace/pearcore-tests/PEAR_PackageFile_Generator_v2/toPackageFile/test_phprelease1.phpt /home/ashnazg/Public/workspace/pearcore-tests/PEAR_PackageFile_Generator_v2/toTgz2/test_extbin.phpt /home/ashnazg/Public/workspace/pearcore-tests/PEAR_Registry/api1_1/test_hasWriteAccess.phpt /home/ashnazg/Public/workspace/pearcore-tests/PEAR_RunTest/bug10286.phpt

« previous php.pear.qa (#5442) next »