Re: Re: PEAR 1.9 release
| From: | Chuck Burgess | Date: | Sat, 22 Aug 2009 22:04:21 +0000 |
| Subject: | Re: Re: PEAR 1.9 release | ||
| References: | 1 2 3 4 5 | Groups: | php.pear.qa |
| Request: | Send a blank email to pear-qa+get-5448@lists.php.net to get a copy of this message | ||
2009/8/22 Helgi Þormar Þorbjörnsson <helgith@gmail.com>
> It could be that the version check for the calling of that function is
> just checking if it's PHP 5 in general. Not a big issue since we don't
> support 5.0 anymore but I could adjust it.
>
> Those failing tests are I suspect due to the fact I changed REST
> listAll to log the retrieving data line with a NL at the end as it was
> making pear search and other functions come out kind funky without it.
> I will adjust the tests.
>
> - Helgi
>
My results now:
PHP 4.4.9:
TOTAL TIME: 02:34
674 PASSED TESTS
22 SKIPPED TESTS
6 FAILED TESTS:
/home/ashnazg/Public/workspace/pear-core/tests/PEAR_Command_Install/upgrade/test_bug16046.phpt
/home/ashnazg/Public/workspace/pear-core/tests/PEAR_Command_Remote/list-upgrades/test.phpt
/home/ashnazg/Public/workspace/pear-core/tests/PEAR_PackageFile_Generator_v2/toPackageFile/test_phprelease1.phpt
/home/ashnazg/Public/workspace/pear-core/tests/PEAR_PackageFile_Generator_v2/toTgz2/test_extbin.phpt
/home/ashnazg/Public/workspace/pear-core/tests/PEAR_Registry/api1_1/test_hasWriteAccess.phpt
/home/ashnazg/Public/workspace/pear-core/tests/PEAR_RunTest/bug10286.phpt
PHP 5.0.5:
TOTAL TIME: 03:28
677 PASSED TESTS
16 SKIPPED TESTS
9 FAILED TESTS:
/home/ashnazg/Public/workspace/pear-core/tests/PEAR_Command_Install/upgrade/test_bug16046.phpt
/home/ashnazg/Public/workspace/pear-core/tests/PEAR_Command_Remote/list-upgrades/test.phpt
/home/ashnazg/Public/workspace/pear-core/tests/PEAR_Registry/api1_1/test_hasWriteAccess.phpt
/home/ashnazg/Public/workspace/pear-core/tests/PEAR_RunTest/test_bug10092cookie.phpt
/home/ashnazg/Public/workspace/pear-core/tests/PEAR_RunTest/test_bug10092get.phpt
/home/ashnazg/Public/workspace/pear-core/tests/PEAR_RunTest/test_bug10092post.phpt
/home/ashnazg/Public/workspace/pear-core/tests/PEAR_RunTest/test_bug10092post_raw1.phpt
/home/ashnazg/Public/workspace/pear-core/tests/PEAR_RunTest/test_bug10092post_raw2.phpt
/home/ashnazg/Public/workspace/pear-core/tests/PEAR_RunTest/test_bug10092upload.phpt
PHP 5.1.6:
TOTAL TIME: 03:22
677 PASSED TESTS
16 SKIPPED TESTS
9 FAILED TESTS:
/home/ashnazg/Public/workspace/pear-core/tests/PEAR_Command_Install/upgrade/test_bug16046.phpt
/home/ashnazg/Public/workspace/pear-core/tests/PEAR_Command_Remote/list-upgrades/test.phpt
/home/ashnazg/Public/workspace/pear-core/tests/PEAR_Registry/api1_1/test_hasWriteAccess.phpt
/home/ashnazg/Public/workspace/pear-core/tests/PEAR_RunTest/test_bug10092cookie.phpt
/home/ashnazg/Public/workspace/pear-core/tests/PEAR_RunTest/test_bug10092get.phpt
/home/ashnazg/Public/workspace/pear-core/tests/PEAR_RunTest/test_bug10092post.phpt
/home/ashnazg/Public/workspace/pear-core/tests/PEAR_RunTest/test_bug10092post_raw1.phpt
/home/ashnazg/Public/workspace/pear-core/tests/PEAR_RunTest/test_bug10092post_raw2.phpt
/home/ashnazg/Public/workspace/pear-core/tests/PEAR_RunTest/test_bug10092upload.phpt
PHP 5.2.10:
TOTAL TIME: 03:11
677 PASSED TESTS
16 SKIPPED TESTS
8 FAILED TESTS:
/home/ashnazg/Public/workspace/pear-core/tests/PEAR_Command_Install/upgrade/test_bug16046.phpt
/home/ashnazg/Public/workspace/pear-core/tests/PEAR_Command_Remote/list-upgrades/test.phpt
/home/ashnazg/Public/workspace/pear-core/tests/PEAR_RunTest/test_bug10092cookie.phpt
/home/ashnazg/Public/workspace/pear-core/tests/PEAR_RunTest/test_bug10092get.phpt
/home/ashnazg/Public/workspace/pear-core/tests/PEAR_RunTest/test_bug10092post.phpt
/home/ashnazg/Public/workspace/pear-core/tests/PEAR_RunTest/test_bug10092post_raw1.phpt
/home/ashnazg/Public/workspace/pear-core/tests/PEAR_RunTest/test_bug10092post_raw2.phpt
/home/ashnazg/Public/workspace/pear-core/tests/PEAR_RunTest/test_bug10092upload.phpt
PHP 5.3.0:
TOTAL TIME: 03:03
677 PASSED TESTS
16 SKIPPED TESTS
8 FAILED TESTS:
/home/ashnazg/Public/workspace/pear-core/tests/PEAR_Command_Install/upgrade/test_bug16046.phpt
/home/ashnazg/Public/workspace/pear-core/tests/PEAR_Command_Remote/list-upgrades/test.phpt
/home/ashnazg/Public/workspace/pear-core/tests/PEAR_RunTest/test_bug10092cookie.phpt
/home/ashnazg/Public/workspace/pear-core/tests/PEAR_RunTest/test_bug10092get.phpt
/home/ashnazg/Public/workspace/pear-core/tests/PEAR_RunTest/test_bug10092post.phpt
/home/ashnazg/Public/workspace/pear-core/tests/PEAR_RunTest/test_bug10092post_raw1.phpt
/home/ashnazg/Public/workspace/pear-core/tests/PEAR_RunTest/test_bug10092post_raw2.phpt
/home/ashnazg/Public/workspace/pear-core/tests/PEAR_RunTest/test_bug10092upload.phpt
--
CRB