Re: bcompiler

From: Date: Fri, 03 Sep 2004 16:47:12 +0000
Subject: Re: bcompiler
Groups: php.pecl.dev 
Request: Send a blank email to pecl-dev+get-1258@lists.php.net to get a copy of this message
Hi Stefan, Are you using the correct version of the sources. I think you need the PHP_4 branch to compile with php4. The HEAD is for php5. - Frank > Helo! > > I' m just in trouble with bcompiler. > I want to compile a new bcompiler.so and this is the result: > Any suggestions? > > /opt/lampp/lib/php/extensions/bcompiler/bcompiler.c:2336: error: `zend_uchar' undeclared (first use in this function) > /opt/lampp/lib/php/extensions/bcompiler/bcompiler.c:2336: error: parse error before ')' token > /opt/lampp/lib/php/extensions/bcompiler/bcompiler.c:2337: error: parse error before "TSRMLS_CC" > /opt/lampp/lib/php/extensions/bcompiler/bcompiler.c:2338: error: parse error before "TSRMLS_CC" > /opt/lampp/lib/php/extensions/bcompiler/bcompiler.c:2339: error: `zend_uint' undeclared (first use in this function) > /opt/lampp/lib/php/extensions/bcompiler/bcompiler.c:2339: error: parse error before ')' token > /opt/lampp/lib/php/extensions/bcompiler/bcompiler.c:2340: error: parse error before ')' token > /opt/lampp/lib/php/extensions/bcompiler/bcompiler.c:2341: error: parse error before ')' token > /opt/lampp/lib/php/extensions/bcompiler/bcompiler.c:2357: error: `zval' undeclared (first use in this function) > /opt/lampp/lib/php/extensions/bcompiler/bcompiler.c:2357: error: parse error before "myretval" > /opt/lampp/lib/php/extensions/bcompiler/bcompiler.c:2357: error: `sendval' undeclared (first use in this function) > /opt/lampp/lib/php/extensions/bcompiler/bcompiler.c:2357: error: `function_table' undeclared (first use in this function) > /opt/lampp/lib/php/extensions/bcompiler/bcompiler.c:2357: error: `myretval' undeclared (first use in this function) > /opt/lampp/lib/php/extensions/bcompiler/bcompiler.c:2357: error: parse error before "TSRMLS_CC" > /opt/lampp/lib/php/extensions/bcompiler/bcompiler.c: At top level: > /opt/lampp/lib/php/extensions/bcompiler/bcompiler.c:2358: error: parse error before "for" > /opt/lampp/lib/php/extensions/bcompiler/bcompiler.c:2363: error: parse error before '*' token > /opt/lampp/lib/php/extensions/bcompiler/bcompiler.c:2363: error: parse error before '(' token > /opt/lampp/lib/php/extensions/bcompiler/bcompiler.c:2363: error: parse error before "size_t" > /opt/lampp/lib/php/extensions/bcompiler/bcompiler.c:2364: error: parse error before '*' token > /opt/lampp/lib/php/extensions/bcompiler/bcompiler.c:2364: error: parse error before '(' token > /opt/lampp/lib/php/extensions/bcompiler/bcompiler.c:2364: error: parse error before "size_t" > /opt/lampp/lib/php/extensions/bcompiler/bcompiler.c:2365: error: parse error before '*' token > /opt/lampp/lib/php/extensions/bcompiler/bcompiler.c:2365: error: parse error before '(' token > /opt/lampp/lib/php/extensions/bcompiler/bcompiler.c:2365: error: parse error before "size_t" > /opt/lampp/lib/php/extensions/bcompiler/bcompiler.c:2366: error: parse error before '*' token > /opt/lampp/lib/php/extensions/bcompiler/bcompiler.c:2366: error: parse error before '(' token > /opt/lampp/lib/php/extensions/bcompiler/bcompiler.c:2366: error: parse error before "size_t" > /opt/lampp/lib/php/extensions/bcompiler/bcompiler.c:2367: error: `exists' used prior to declaration > /opt/lampp/lib/php/extensions/bcompiler/bcompiler.c:2367: error: `zoa' undeclared here (not in a function) > /opt/lampp/lib/php/extensions/bcompiler/bcompiler.c:2367: warning: data definition has no type or storage class > /opt/lampp/lib/php/extensions/bcompiler/bcompiler.c:2368: error: parse error before '{' token > /opt/lampp/lib/php/extensions/bcompiler/bcompiler.c:2368: error: parse error before "char" > /opt/lampp/lib/php/extensions/bcompiler/bcompiler.c:2368: error: parse error before '(' token > /opt/lampp/lib/php/extensions/bcompiler/bcompiler.c:2368: error: parse error before "size_t" > /opt/lampp/lib/php/extensions/bcompiler/bcompiler.c:2371: error: parse error before '(' token > /opt/lampp/lib/php/extensions/bcompiler/bcompiler.c:2371: error: parse error before "char" > /opt/lampp/lib/php/extensions/bcompiler/bcompiler.c:2373: error: parse error before '->' token > /opt/lampp/lib/php/extensions/bcompiler/bcompiler.c:2373: warning: data definition has no type or storage class > /opt/lampp/lib/php/extensions/bcompiler/bcompiler.c:2374: error: parse error before '->' token > /opt/lampp/lib/php/extensions/bcompiler/bcompiler.c:2375: error: parse error before '*' token > /opt/lampp/lib/php/extensions/bcompiler/bcompiler.c:2375: error: parse error before '(' token > /opt/lampp/lib/php/extensions/bcompiler/bcompiler.c:2375: error: parse error before "size_t" > /opt/lampp/lib/php/extensions/bcompiler/bcompiler.c:2376: error: parse error before '*' token > /opt/lampp/lib/php/extensions/bcompiler/bcompiler.c:2376: error: parse error before '(' token > /opt/lampp/lib/php/extensions/bcompiler/bcompiler.c:2376: error: parse error before "size_t" > /opt/lampp/lib/php/extensions/bcompiler/bcompiler.c:2377: error: parse error before '->' token > /opt/lampp/lib/php/extensions/bcompiler/bcompiler.c:2377: error: conflicting types for `apc_serialize_string' > /opt/lampp/lib/php/extensions/bcompiler/bcompiler.c:1472: error: previous declaration of `apc_serialize_string' > /opt/lampp/lib/php/extensions/bcompiler/bcompiler.c:2377: warning: data definition has no type or storage class > /opt/lampp/lib/php/extensions/bcompiler/bcompiler.c:2379: error: parse error before '(' token > /opt/lampp/lib/php/extensions/bcompiler/bcompiler.c:2379: error: parse error before '(' token > /opt/lampp/lib/php/extensions/bcompiler/bcompiler.c:2379: warning: initialization makes integer from pointer without a cast > /opt/lampp/lib/php/extensions/bcompiler/bcompiler.c:2379: error: initializer element is not constant > /opt/lampp/lib/php/extensions/bcompiler/bcompiler.c:2379: warning: data definition has no type or storage class > /opt/lampp/lib/php/extensions/bcompiler/bcompiler.c:2379: error: parse error before '(' token > /opt/lampp/lib/php/extensions/bcompiler/bcompiler.c:2379: error: parse error before '(' token > /opt/lampp/lib/php/extensions/bcompiler/bcompiler.c:2383: error: `sendval' used prior to declaration > /opt/lampp/lib/php/extensions/bcompiler/bcompiler.c:2383: warning: data definition has no type or storage class > /opt/lampp/lib/php/extensions/bcompiler/bcompiler.c:2383: error: parse error before "if" > /opt/lampp/lib/php/extensions/bcompiler/bcompiler.c:2383: warning: parameter names (without types) in function declaration > /opt/lampp/lib/php/extensions/bcompiler/bcompiler.c:2383: warning: data definition has no type or storage class > /opt/lampp/lib/php/extensions/bcompiler/bcompiler.c:2383: error: parse error before "if" > /opt/lampp/lib/php/extensions/bcompiler/bcompiler.c:2388: error: parse error before '*' token > /opt/lampp/lib/php/extensions/bcompiler/bcompiler.c: In function `apc_deserialize_zend_op_array': > /opt/lampp/lib/php/extensions/bcompiler/bcompiler.c:2394: error: `bcompiler_globals' undeclared (first use in this function) > /opt/lampp/lib/php/extensions/bcompiler/bcompiler.c:2394: error: `E_WARNING' undeclared (first use in this function) > /opt/lampp/lib/php/extensions/bcompiler/bcompiler.c:2394: error: `zend_uchar' undeclared (first use in this function) > /opt/lampp/lib/php/extensions/bcompiler/bcompiler.c:2394: error: `zoa' undeclared (first use in this function) > /opt/lampp/lib/php/extensions/bcompiler/bcompiler.c:2394: error: parse error before ')' token > /opt/lampp/lib/php/extensions/bcompiler/bcompiler.c:2395: error: parse error before "TSRMLS_CC" > /opt/lampp/lib/php/extensions/bcompiler/bcompiler.c:2396: error: parse error before "TSRMLS_CC" > /opt/lampp/lib/php/extensions/bcompiler/bcompiler.c:2397: error: `zend_uint' undeclared (first use in this function) > /opt/lampp/lib/php/extensions/bcompiler/bcompiler.c:2398: error: parse error before ')' token > /opt/lampp/lib/php/extensions/bcompiler/bcompiler.c:2399: error: parse error before ')' token > /opt/lampp/lib/php/extensions/bcompiler/bcompiler.c:2400: error: parse error before ')' token > /opt/lampp/lib/php/extensions/bcompiler/bcompiler.c:2405: error: `zend_op' undeclared (first use in this function) > /opt/lampp/lib/php/extensions/bcompiler/bcompiler.c:2405: error: parse error before ')' token > /opt/lampp/lib/php/extensions/bcompiler/bcompiler.c:2408: error: parse error before "TSRMLS_CC" > /opt/lampp/lib/php/extensions/bcompiler/bcompiler.c:2409: error: `ZEND_DECLARE_FUNCTION_OR_CLASS' undeclared (first use in this function) > /opt/lampp/lib/php/extensions/bcompiler/bcompiler.c:2410: error: `HashTable' undeclared (first use in this function) > /opt/lampp/lib/php/extensions/bcompiler/bcompiler.c:2410: error: `table' undeclared (first use in this function) > /opt/lampp/lib/php/extensions/bcompiler/bcompiler.c:2422: error: `ZEND_DECLARE_FUNCTION' undeclared (first use in this function) > /opt/lampp/lib/php/extensions/bcompiler/bcompiler.c:2424: error: `zend_function' undeclared (first use in this function) > /opt/lampp/lib/php/extensions/bcompiler/bcompiler.c:2424: error: `function' undeclared (first use in this function) > /opt/lampp/lib/php/extensions/bcompiler/bcompiler.c:2426: error: `function_table' undeclared (first use in this function) > /opt/lampp/lib/php/extensions/bcompiler/bcompiler.c:2429: error: `SUCCESS' undeclared (first use in this function) > /opt/lampp/lib/php/extensions/bcompiler/bcompiler.c:2433: error: `ZEND_NOP' undeclared (first use in this function) > /opt/lampp/lib/php/extensions/bcompiler/bcompiler.c:2434: error: `znode' undeclared (first use in this function) > /opt/lampp/lib/php/extensions/bcompiler/bcompiler.c:2436: error: `IS_UNUSED' undeclared (first use in this function) > /opt/lampp/lib/php/extensions/bcompiler/bcompiler.c:2443: error: `ZEND_DECLARE_CLASS' undeclared (first use in this function) > /opt/lampp/lib/php/extensions/bcompiler/bcompiler.c:2445: error: `zend_class_entry' undeclared (first use in this function) > /opt/lampp/lib/php/extensions/bcompiler/bcompiler.c:2445: error: `ce' undeclared (first use in this function) > /opt/lampp/lib/php/extensions/bcompiler/bcompiler.c:2447: error: `class_table' undeclared (first use in this function) > /opt/lampp/lib/php/extensions/bcompiler/bcompiler.c:2463: error: `ZEND_DECLARE_INHERITED_CLASS' undeclared (first use in this function) > /opt/lampp/lib/php/extensions/bcompiler/bcompiler.c:2481: error: `E_CORE_ERROR' undeclared (first use in this function) > /opt/lampp/lib/php/extensions/bcompiler/bcompiler.c:2551: error: parse error before ')' token > /opt/lampp/lib/php/extensions/bcompiler/bcompiler.c:2552: error: parse error before ')' token > /opt/lampp/lib/php/extensions/bcompiler/bcompiler.c:2553: error: parse error before ')' token > /opt/lampp/lib/php/extensions/bcompiler/bcompiler.c:2554: error: `zend_bool' undeclared (first use in this function) > /opt/lampp/lib/php/extensions/bcompiler/bcompiler.c:2554: error: parse error before ')' token > /opt/lampp/lib/php/extensions/bcompiler/bcompiler.c:2558: error: `zend_brk_cont_element' undeclared (first use in this function) > /opt/lampp/lib/php/extensions/bcompiler/bcompiler.c:2558: error: parse error before ')' token > /opt/lampp/lib/php/extensions/bcompiler/bcompiler.c:2563: error: `zval' undeclared (first use in this function) > /opt/lampp/lib/php/extensions/bcompiler/bcompiler.c:2563: error: parse error before ')' token > /opt/lampp/lib/php/extensions/bcompiler/bcompiler.c:2567: error: parse error before ')' token > /opt/lampp/lib/php/extensions/bcompiler/bcompiler.c:2568: error: parse error before ')' token > /opt/lampp/lib/php/extensions/bcompiler/bcompiler.c:2569: error: parse error before "TSRMLS_CC" > /opt/lampp/lib/php/extensions/bcompiler/bcompiler.c:2570: error: parse error before "TSRMLS_CC" > /opt/lampp/lib/php/extensions/bcompiler/bcompiler.c:2572: error: `master' undeclared (first use in this function) > /opt/lampp/lib/php/extensions/bcompiler/bcompiler.c: At top level: > /opt/lampp/lib/php/extensions/bcompiler/bcompiler.c:2578: error: parse error before '*' token > /opt/lampp/lib/php/extensions/bcompiler/bcompiler.c: In function `apc_create_zend_op_array': > /opt/lampp/lib/php/extensions/bcompiler/bcompiler.c:2580: error: `zoa' undeclared (first use in this function) > /opt/lampp/lib/php/extensions/bcompiler/bcompiler.c:2580: error: `zend_op_array' undeclared (first use in this function) > /opt/lampp/lib/php/extensions/bcompiler/bcompiler.c:2580: error: parse error before ')' token > /opt/lampp/lib/php/extensions/bcompiler/bcompiler.c:2581: error: parse error before "TSRMLS_CC" > /opt/lampp/lib/php/extensions/bcompiler/bcompiler.c: At top level: > /opt/lampp/lib/php/extensions/bcompiler/bcompiler.c:2589: error: parse error before '*' token > /opt/lampp/lib/php/extensions/bcompiler/bcompiler.c: In function `apc_serialize_zend_internal_function': > /opt/lampp/lib/php/extensions/bcompiler/bcompiler.c:2591: error: `bcompiler_globals' undeclared (first use in this function) > /opt/lampp/lib/php/extensions/bcompiler/bcompiler.c:2591: error: `zend_uchar' undeclared (first use in this function) > /opt/lampp/lib/php/extensions/bcompiler/bcompiler.c:2591: error: parse error before ')' token > /opt/lampp/lib/php/extensions/bcompiler/bcompiler.c:2592: error: `zif' undeclared (first use in this function) > /opt/lampp/lib/php/extensions/bcompiler/bcompiler.c:2592: error: parse error before "TSRMLS_CC" > /opt/lampp/lib/php/extensions/bcompiler/bcompiler.c:2593: error: parse error before "TSRMLS_CC" > /opt/lampp/lib/php/extensions/bcompiler/bcompiler.c: At top level: > /opt/lampp/lib/php/extensions/bcompiler/bcompiler.c:2597: error: parse error before '*' token > /opt/lampp/lib/php/extensions/bcompiler/bcompiler.c: In function `apc_deserialize_zend_internal_function': > /opt/lampp/lib/php/extensions/bcompiler/bcompiler.c:2599: error: `bcompiler_globals' undeclared (first use in this function) > /opt/lampp/lib/php/extensions/bcompiler/bcompiler.c:2599: error: `E_WARNING' undeclared (first use in this function) > /opt/lampp/lib/php/extensions/bcompiler/bcompiler.c:2599: error: `zend_uchar' undeclared (first use in this function) > /opt/lampp/lib/php/extensions/bcompiler/bcompiler.c:2599: error: `zif' undeclared (first use in this function) > /opt/lampp/lib/php/extensions/bcompiler/bcompiler.c:2599: error: parse error before ')' token > /opt/lampp/lib/php/extensions/bcompiler/bcompiler.c:2600: error: parse error before "TSRMLS_CC" > /opt/lampp/lib/php/extensions/bcompiler/bcompiler.c:2601: error: parse error before "TSRMLS_CC" > /opt/lampp/lib/php/extensions/bcompiler/bcompiler.c: At top level: > /opt/lampp/lib/php/extensions/bcompiler/bcompiler.c:2609: error: parse error before '*' token > /opt/lampp/lib/php/extensions/bcompiler/bcompiler.c: In function `apc_serialize_zend_overloaded_function': > /opt/lampp/lib/php/extensions/bcompiler/bcompiler.c:2611: error: `bcompiler_globals' undeclared (first use in this function) > /opt/lampp/lib/php/extensions/bcompiler/bcompiler.c:2611: error: `zend_uchar' undeclared (first use in this function) > /opt/lampp/lib/php/extensions/bcompiler/bcompiler.c:2611: error: parse error before ')' token > /opt/lampp/lib/php/extensions/bcompiler/bcompiler.c:2612: error: `zof' undeclared (first use in this function) > /opt/lampp/lib/php/extensions/bcompiler/bcompiler.c:2612: error: parse error before "TSRMLS_CC" > /opt/lampp/lib/php/extensions/bcompiler/bcompiler.c:2613: error: parse error before "TSRMLS_CC" > /opt/lampp/lib/php/extensions/bcompiler/bcompiler.c:2614: error: `zend_uint' undeclared (first use in this function) > /opt/lampp/lib/php/extensions/bcompiler/bcompiler.c:2614: error: parse error before ')' token > /opt/lampp/lib/php/extensions/bcompiler/bcompiler.c: At top level: > /opt/lampp/lib/php/extensions/bcompiler/bcompiler.c:2617: error: parse error before '*' token > /opt/lampp/lib/php/extensions/bcompiler/bcompiler.c: In function `apc_deserialize_zend_overloaded_function': > /opt/lampp/lib/php/extensions/bcompiler/bcompiler.c:2619: error: `bcompiler_globals' undeclared (first use in this function) > /opt/lampp/lib/php/extensions/bcompiler/bcompiler.c:2619: error: `E_WARNING' undeclared (first use in this function) > /opt/lampp/lib/php/extensions/bcompiler/bcompiler.c:2619: error: `zend_uchar' undeclared (first use in this function) > /opt/lampp/lib/php/extensions/bcompiler/bcompiler.c:2619: error: `zof' undeclared (first use in this function) > /opt/lampp/lib/php/extensions/bcompiler/bcompiler.c:2619: error: parse error before ')' token > /opt/lampp/lib/php/extensions/bcompiler/bcompiler.c:2620: error: parse error before "TSRMLS_CC" > /opt/lampp/lib/php/extensions/bcompiler/bcompiler.c:2621: error: parse error before "TSRMLS_CC" > /opt/lampp/lib/php/extensions/bcompiler/bcompiler.c:2622: error: `zend_uint' undeclared (first use in this function) > /opt/lampp/lib/php/extensions/bcompiler/bcompiler.c:2622: error: parse error before ')' token > /opt/lampp/lib/php/extensions/bcompiler/bcompiler.c: At top level: > /opt/lampp/lib/php/extensions/bcompiler/bcompiler.c:2628: error: parse error before '*' token > /opt/lampp/lib/php/extensions/bcompiler/bcompiler.c:2629: error: conflicting types for `apc_serialize_zend_function' > /opt/lampp/lib/php/extensions/bcompiler/bcompiler.c:729: error: previous declaration of `apc_serialize_zend_function' > /opt/lampp/lib/php/extensions/bcompiler/bcompiler.c: In function `apc_serialize_zend_function': > /opt/lampp/lib/php/extensions/bcompiler/bcompiler.c:2635: error: `bcompiler_globals' undeclared (first use in this function) > /opt/lampp/lib/php/extensions/bcompiler/bcompiler.c:2635: error: `zend_uchar' undeclared (first use in this function) > /opt/lampp/lib/php/extensions/bcompiler/bcompiler.c:2635: error: parse error before ')' token > /opt/lampp/lib/php/extensions/bcompiler/bcompiler.c:2638: error: `zf' undeclared (first use in this function) > /opt/lampp/lib/php/extensions/bcompiler/bcompiler.c:2640: error: `ZEND_INTERNAL_FUNCTION' undeclared (first use in this function) > /opt/lampp/lib/php/extensions/bcompiler/bcompiler.c:2641: error: parse error before "TSRMLS_CC" > /opt/lampp/lib/php/extensions/bcompiler/bcompiler.c:2643: error: `ZEND_OVERLOADED_FUNCTION' undeclared (first use in this function) > /opt/lampp/lib/php/extensions/bcompiler/bcompiler.c:2644: error: parse error before "TSRMLS_CC" > /opt/lampp/lib/php/extensions/bcompiler/bcompiler.c:2646: error: `ZEND_USER_FUNCTION' undeclared (first use in this function) > /opt/lampp/lib/php/extensions/bcompiler/bcompiler.c:2647: error: `ZEND_EVAL_CODE' undeclared (first use in this function) > /opt/lampp/lib/php/extensions/bcompiler/bcompiler.c:2649: error: parse error before "TSRMLS_CC" > /opt/lampp/lib/php/extensions/bcompiler/bcompiler.c: At top level: > /opt/lampp/lib/php/extensions/bcompiler/bcompiler.c:2658: error: parse error before '*' token > /opt/lampp/lib/php/extensions/bcompiler/bcompiler.c: In function `apc_deserialize_zend_function': > /opt/lampp/lib/php/extensions/bcompiler/bcompiler.c:2661: error: `bcompiler_globals' undeclared (first use in this function) > /opt/lampp/lib/php/extensions/bcompiler/bcompiler.c:2661: error: `E_WARNING' undeclared (first use in this function) > /opt/lampp/lib/php/extensions/bcompiler/bcompiler.c:2661: error: `zend_uchar' undeclared (first use in this function) > /opt/lampp/lib/php/extensions/bcompiler/bcompiler.c:2661: error: `zf' undeclared (first use in this function) > /opt/lampp/lib/php/extensions/bcompiler/bcompiler.c:2661: error: parse error before ')' token > /opt/lampp/lib/php/extensions/bcompiler/bcompiler.c:2664: error: `ZEND_INTERNAL_FUNCTION' undeclared (first use in this function) > /opt/lampp/lib/php/extensions/bcompiler/bcompiler.c:2665: error: parse error before "TSRMLS_CC" > /opt/lampp/lib/php/extensions/bcompiler/bcompiler.c:2667: error: `ZEND_OVERLOADED_FUNCTION' undeclared (first use in this function) > /opt/lampp/lib/php/extensions/bcompiler/bcompiler.c:2668: error: parse error before "TSRMLS_CC" > /opt/lampp/lib/php/extensions/bcompiler/bcompiler.c:2670: error: `ZEND_USER_FUNCTION' undeclared (first use in this function) > /opt/lampp/lib/php/extensions/bcompiler/bcompiler.c:2671: error: `ZEND_EVAL_CODE' undeclared (first use in this function) > /opt/lampp/lib/php/extensions/bcompiler/bcompiler.c:2672: error: parse error before "TSRMLS_CC" > /opt/lampp/lib/php/extensions/bcompiler/bcompiler.c: At top level: > /opt/lampp/lib/php/extensions/bcompiler/bcompiler.c:2681: error: parse error before '*' token > /opt/lampp/lib/php/extensions/bcompiler/bcompiler.c:2682: error: `apc_create_zend_function' used prior to declaration > /opt/lampp/lib/php/extensions/bcompiler/bcompiler.c:2682: warning: `apc_create_zend_function' was previously implicitly declared to return `int' > /opt/lampp/lib/php/extensions/bcompiler/bcompiler.c: In function `apc_create_zend_function': > /opt/lampp/lib/php/extensions/bcompiler/bcompiler.c:2683: error: `zf' undeclared (first use in this function) > /opt/lampp/lib/php/extensions/bcompiler/bcompiler.c:2683: error: `zend_function' undeclared (first use in this function) > /opt/lampp/lib/php/extensions/bcompiler/bcompiler.c:2683: error: parse error before ')' token > /opt/lampp/lib/php/extensions/bcompiler/bcompiler.c:2684: error: parse error before "TSRMLS_CC" > /opt/lampp/lib/php/extensions/bcompiler/bcompiler.c: At top level: > /opt/lampp/lib/php/extensions/bcompiler/bcompiler.c:2686: error: parse error before '*' token > /opt/lampp/lib/php/extensions/bcompiler/bcompiler.c:2687: error: `apc_free_zend_function' used prior to declaration > /opt/lampp/lib/php/extensions/bcompiler/bcompiler.c: In function `apc_free_zend_function': > /opt/lampp/lib/php/extensions/bcompiler/bcompiler.c:2688: error: `zf' undeclared (first use in this function) > /opt/lampp/lib/php/extensions/bcompiler/bcompiler.c: At top level: > /opt/lampp/lib/php/extensions/bcompiler/bcompiler.c:2695: error: parse error before '*' token > /opt/lampp/lib/php/extensions/bcompiler/bcompiler.c:2696: error: conflicting types for `apc_serialize_zend_constant' > /opt/lampp/lib/php/extensions/bcompiler/bcompiler.c:690: error: previous declaration of `apc_serialize_zend_constant' > /opt/lampp/lib/php/extensions/bcompiler/bcompiler.c: In function `apc_serialize_zend_constant': > /opt/lampp/lib/php/extensions/bcompiler/bcompiler.c:2697: error: `zc' undeclared (first use in this function) > /opt/lampp/lib/php/extensions/bcompiler/bcompiler.c:2697: error: parse error before "TSRMLS_CC" > /opt/lampp/lib/php/extensions/bcompiler/bcompiler.c:2698: error: `bcompiler_globals' undeclared (first use in this function) > /opt/lampp/lib/php/extensions/bcompiler/bcompiler.c:2699: error: parse error before "TSRMLS_CC" > /opt/lampp/lib/php/extensions/bcompiler/bcompiler.c: At top level: > /opt/lampp/lib/php/extensions/bcompiler/bcompiler.c:2705: error: parse error before '*' token > /opt/lampp/lib/php/extensions/bcompiler/bcompiler.c: In function `apc_deserialize_zend_constant': > /opt/lampp/lib/php/extensions/bcompiler/bcompiler.c:2707: error: `zc' undeclared (first use in this function) > /opt/lampp/lib/php/extensions/bcompiler/bcompiler.c:2707: error: parse error before "TSRMLS_CC" > /opt/lampp/lib/php/extensions/bcompiler/bcompiler.c:2708: error: `bcompiler_globals' undeclared (first use in this function) > /opt/lampp/lib/php/extensions/bcompiler/bcompiler.c:2708: error: `E_WARNING' undeclared (first use in this function) > /opt/lampp/lib/php/extensions/bcompiler/bcompiler.c:2709: error: parse error before "TSRMLS_CC" > /opt/lampp/lib/php/extensions/bcompiler/bcompiler.c: At top level: > /opt/lampp/lib/php/extensions/bcompiler/bcompiler.c:2715: error: parse error before '*' token > /opt/lampp/lib/php/extensions/bcompiler/bcompiler.c:2716: warning: type mismatch with previous implicit declaration > /opt/lampp/lib/php/extensions/bcompiler/bcompiler.c:1119: warning: previous implicit declaration of `apc_create_zend_constant' > /opt/lampp/lib/php/extensions/bcompiler/bcompiler.c:2716: warning: `apc_create_zend_constant' was previously implicitly declared to return `int' > /opt/lampp/lib/php/extensions/bcompiler/bcompiler.c: In function `apc_create_zend_constant': > /opt/lampp/lib/php/extensions/bcompiler/bcompiler.c:2717: error: `zc' undeclared (first use in this function) > /opt/lampp/lib/php/extensions/bcompiler/bcompiler.c:2717: error: `zend_constant' undeclared (first use in this function) > /opt/lampp/lib/php/extensions/bcompiler/bcompiler.c:2717: error: parse error before ')' token > /opt/lampp/lib/php/extensions/bcompiler/bcompiler.c:2718: error: parse error before "TSRMLS_CC" > make: *** [bcompiler.lo] Error 1 > > > > > /bin/sh /opt/lampp/lib/php/extensions/bcompiler/libtool --mode=compile gcc -I. > > -I/opt/lampp/lib/php/extensions/bcompiler -DPHP_ATOM_INC -I/opt/lampp/lib/php/extensions/bcompiler/include > -I/opt/lampp/lib/php/extensions/bcompiler/main -I/opt/lampp/lib/php/extensions/bcompiler -I/usr/include/php > -I/usr/include/php/main -I/usr/include/php/Zend -I/usr/include/php/TSRM -DHAVE_CONFIG_H -g -O2 -prefer-pic -c > /opt/lampp/lib/php/extensions/bcompiler/bcompiler.c -o bcompiler.lo > > gcc -I. -I/opt/lampp/lib/php/extensions/bcompiler -DPHP_ATOM_INC -I/opt/lampp/lib/php/extensions/bcompiler/include > -I/opt/lampp/lib/php/extensions/bcompiler/main -I/opt/lampp/lib/php/extensions/bcompiler -I/usr/include/php > -I/usr/include/php/main -I/usr/include/php/Zend -I/usr/include/php/TSRM -DHAVE_CONFIG_H -g -O2 -c > /opt/lampp/lib/php/extensions/bcompiler/bcompiler.c -fPIC -DPIC -o .libs/bcompiler.o > > > > > > ------------------------------------------ > Stefan Werthmann > Max Planck Institute for Human Development > Center for Educational Research > Lentzeallee 94 > 141 95 Berlin - Germany > Tel. 82406-450, Zimmer 139a > E-Mail: werthmann@mpib-berlin.mpg.de > ------------------------------------------ > > -- > PECL development discussion Mailing List (http://pecl.php.net/) > To unsubscribe, visit: http://www.php.net/unsub.php >

« previous php.pecl.dev (#1258) next »