You may have found a problem in PHP.
| From: | 麟玄璇宇儿 | Date: | Sat, 15 Apr 2017 05:06:13 +0000 |
| Subject: | You may have found a problem in PHP. | ||
| Groups: | php.qa.reports | ||
| Request: | Send a blank email to php-qa-reports+get-33961@lists.php.net to get a copy of this message | ||
=====================================================================
TIME END 2017-04-15 05:00:58
=====================================================================
TEST RESULT SUMMARY
---------------------------------------------------------------------
Exts skipped : 48
Exts tested : 26
---------------------------------------------------------------------
Number of tests : 15343 10223
Tests skipped : 5120 ( 33.4%) --------
Tests warned : 0 ( 0.0%) ( 0.0%)
Tests failed : 31 ( 0.2%) ( 0.3%)
Expected fail : 35 ( 0.2%) ( 0.3%)
Tests passed : 10157 ( 66.2%) ( 99.4%)
---------------------------------------------------------------------
Time taken : 473 seconds
=====================================================================
=====================================================================
EXPECTED FAILED TEST SUMMARY
---------------------------------------------------------------------
Test open_basedir configuration [tests/security/open_basedir_linkinfo.phpt]
XFAIL REASON: BUG: open_basedir cannot delete symlink to prohibited file.
See also
bugs 48111 and 52176.
Inconsistencies when accessing protected members
[Zend/tests/access_modifiers_008.phpt] XFAIL REASON: Discussion:
http://marc.info/?l=php-internals&m=120221184420957&w=2
Inconsistencies when accessing protected members - 2
[Zend/tests/access_modifiers_009.phpt] XFAIL REASON: Discussion:
http://marc.info/?l=php-internals&m=120221184420957&w=2
Bug #48770 (call_user_func_array() fails to call parent from inheriting
class) [Zend/tests/bug48770.phpt] XFAIL REASON: See Bug #48770
Bug #48770 (call_user_func_array() fails to call parent from inheriting
class) [Zend/tests/bug48770_2.phpt] XFAIL REASON: See Bug #48770
Bug #48770 (call_user_func_array() fails to call parent from inheriting
class) [Zend/tests/bug48770_3.phpt] XFAIL REASON: See Bug #48770
Initial value of static var in method depends on the include time of the
class definition [Zend/tests/method_static_var.phpt] XFAIL REASON: Maybe
not a bug
DateTime::add() -- fall type2 type3
[ext/date/tests/DateTime_add-fall-type2-type3.phpt] XFAIL REASON: Various
bugs exist
DateTime::add() -- fall type3 type2
[ext/date/tests/DateTime_add-fall-type3-type2.phpt] XFAIL REASON: Various
bugs exist
DateTime::add() -- fall type3 type3
[ext/date/tests/DateTime_add-fall-type3-type3.phpt] XFAIL REASON: Various
bugs exist
DateTime::add() -- spring type2 type3
[ext/date/tests/DateTime_add-spring-type2-type3.phpt] XFAIL REASON: Various
bugs exist
DateTime::add() -- spring type3 type2
[ext/date/tests/DateTime_add-spring-type3-type2.phpt] XFAIL REASON: Various
bugs exist
DateTime::add() -- spring type3 type3
[ext/date/tests/DateTime_add-spring-type3-type3.phpt] XFAIL REASON: Various
bugs exist
DateTime::diff() -- fall type2 type3
[ext/date/tests/DateTime_diff-fall-type2-type3.phpt] XFAIL REASON: Various
bugs exist
DateTime::diff() -- fall type3 type2
[ext/date/tests/DateTime_diff-fall-type3-type2.phpt] XFAIL REASON: Various
bugs exist
DateTime::diff() -- fall type3 type3
[ext/date/tests/DateTime_diff-fall-type3-type3.phpt] XFAIL REASON: Various
bugs exist
DateTime::diff() -- spring type2 type3
[ext/date/tests/DateTime_diff-spring-type2-type3.phpt] XFAIL REASON:
Various bugs exist
DateTime::diff() -- spring type3 type2
[ext/date/tests/DateTime_diff-spring-type3-type2.phpt] XFAIL REASON:
Various bugs exist
DateTime::diff() -- spring type3 type3
[ext/date/tests/DateTime_diff-spring-type3-type3.phpt] XFAIL REASON:
Various bugs exist
DateTime::sub() -- fall type2 type3
[ext/date/tests/DateTime_sub-fall-type2-type3.phpt] XFAIL REASON: Various
bugs exist
DateTime::sub() -- fall type3 type2
[ext/date/tests/DateTime_sub-fall-type3-type2.phpt] XFAIL REASON: Various
bugs exist
DateTime::sub() -- fall type3 type3
[ext/date/tests/DateTime_sub-fall-type3-type3.phpt] XFAIL REASON: Various
bugs exist
DateTime::sub() -- spring type2 type3
[ext/date/tests/DateTime_sub-spring-type2-type3.phpt] XFAIL REASON: Various
bugs exist
DateTime::sub() -- spring type3 type2
[ext/date/tests/DateTime_sub-spring-type3-type2.phpt] XFAIL REASON: Various
bugs exist
DateTime::sub() -- spring type3 type3
[ext/date/tests/DateTime_sub-spring-type3-type3.phpt] XFAIL REASON: Various
bugs exist
Bug #55407 (Impossible to prototype DateTime::createFromFormat)
[ext/date/tests/bug55407.phpt] XFAIL REASON: Bug #55407
RFC: DateTime and Daylight Saving Time Transitions (zone type 3, bd2)
[ext/date/tests/rfc-datetime_and_daylight_saving_time-type3-bd2.phpt] XFAIL
REASON: Still not quite right
RFC: DateTime and Daylight Saving Time Transitions (zone type 3, fs)
[ext/date/tests/rfc-datetime_and_daylight_saving_time-type3-fs.phpt] XFAIL
REASON: Still not quite right
Bug #42718 (unsafe_raw filter not applied when configured as default filter)
[ext/filter/tests/bug42718.phpt] XFAIL REASON: FILTER_UNSAFE_RAW not
applied when configured as default filter, even with flags
Bug #67296 (filter_input doesn't validate variables)
[ext/filter/tests/bug49184.phpt] XFAIL REASON: See Bug #49184
Bug #67167: filter_var(null,FILTER_VALIDATE_BOOLEAN,FILTER_NULL_ON_FAILURE)
returns null [ext/filter/tests/bug67167.02.phpt] XFAIL REASON: Requires
php_zval_filter to not use convert_to_string for all filters.
Phar: bug #69958: Segfault in Phar::convertToData on invalid file
[ext/phar/tests/bug69958.phpt] XFAIL REASON: Still has memory leaks, see
https://bugs.php.net/bug.php?id=70005
updateTimestamp never called when session data is empty
[ext/session/tests/bug71162.phpt] XFAIL REASON: Current session module is
designed to write empty session always. In addition, current session module
only supports SessionHandlerInterface only from PHP 7.0.
Bug #70219 Use after free vulnerability in session deserializer
[ext/standard/tests/serialize/bug70219.phpt] XFAIL REASON: Unfinished
merge, needs fix.
Bug #70470 (Built-in server truncates headers spanning over TCP packets)
[sapi/cli/tests/bug70470.phpt] XFAIL REASON: bug is not fixed yet
=====================================================================
=====================================================================
FAILED TEST SUMMARY
---------------------------------------------------------------------
int stream_socket_sendto ( resource $socket , string $data [, int $flags = 0
[, string $address ]] );
[ext/standard/tests/streams/stream_socket_sendto.phpt]
Fundamental breakpoints functionality
[sapi/phpdbg/tests/breakpoints_001.phpt]
Preserve breakpoints on restart [sapi/phpdbg/tests/breakpoints_002.phpt]
Test deleting breakpoints [sapi/phpdbg/tests/breakpoints_003.phpt]
Test opcode breakpoints [sapi/phpdbg/tests/breakpoints_004.phpt]
Test breakpoint into function context
[sapi/phpdbg/tests/breakpoints_005.phpt]
Basic function breakpoints [sapi/phpdbg/tests/breakpoints_006.phpt]
Test namespaced and non-lowercase breakpoint names
[sapi/phpdbg/tests/breakpoints_008.phpt]
Bug #73704 (phpdbg shows the wrong line in files with shebang)
[sapi/phpdbg/tests/bug73704.phpt]
Cleaning must preserve breakpoints [sapi/phpdbg/tests/clean_001.phpt]
Test clearing breakpoints [sapi/phpdbg/tests/clear_001.phpt]
Properly handle exceptions going to be uncaught
[sapi/phpdbg/tests/exceptions_001.phpt]
Test exceptions in eval during exception
[sapi/phpdbg/tests/exceptions_002.phpt]
Ensure proper saving of EX(opline) [sapi/phpdbg/tests/generator_run.phpt]
include_once must include only once [sapi/phpdbg/tests/include_once.phpt]
Test basic info functionality [sapi/phpdbg/tests/info_001.phpt]
A script with die() must end "normally" [sapi/phpdbg/tests/normal_exit.phpt]
Test phpdbg_break_next() function [sapi/phpdbg/tests/phpdbg_break_next.phpt]
Getting executable lines from custom wrappers
[sapi/phpdbg/tests/phpdbg_get_executable_stream_wrapper.phpt]
Test phpdbg_*_oplog() functions [sapi/phpdbg/tests/phpdbg_oplog_001.phpt]
phpdbg_end_oplog() alone must not crash [sapi/phpdbg/tests/phpdbg_oplog_002.
phpt]
Test argv passing [sapi/phpdbg/tests/run_001.phpt]
Stdin and escaped args being passed to run command
[sapi/phpdbg/tests/run_002.phpt]
set_exception_handler() in phpdbg
[sapi/phpdbg/tests/set_exception_handler.phpt]
Test stdin input with breakpoints [sapi/phpdbg/tests/stdin_001.phpt]
Test simple recursive watchpoint [sapi/phpdbg/tests/watch_001.phpt]
Test simple array watchpoint with replace [sapi/phpdbg/tests/watch_002.phpt]
Test simple watchpoint with replace [sapi/phpdbg/tests/watch_003.phpt]
Test detection of inline string manipulations on zval watch
[sapi/phpdbg/tests/watch_004.phpt]
Test proper watch comparisons when having multiple levels of indirection
from a zval to its value [sapi/phpdbg/tests/watch_005.phpt]
Test multiple watch elements pointing to the same watchpoint
[sapi/phpdbg/tests/watch_006.phpt]
=====================================================================
You may have found a problem in PHP.
This report can be automatically sent to the PHP QA team at
http://qa.php.net/reports and http://news.php.net/php.qa.reports
This gives us a better understanding of PHP's behavior.
If you don't want to send the report immediately you can choose
option "s" to save it. You can then email it to qa-reports@lists.php.net
later.
Do you want to send this report now? [Yns]: