PHP 7.1.4 make test failure report
| From: | Zolf Li | Date: | Tue, 18 Apr 2017 03:29:00 +0000 |
| Subject: | PHP 7.1.4 make test failure report | ||
| Groups: | php.qa.reports | ||
| Request: | Send a blank email to php-qa-reports+get-33962@lists.php.net to get a copy of this message | ||
Check the attachment.
===================================================================== EXPECTED FAILED TEST SUMMARY --------------------------------------------------------------------- Test open_basedir configuration [tests/security/open_basedir_linkinfo.phpt] XFAIL REASON: BUG: open_basedir cannot delete symlink to prohibited file. See also bugs 48111 and 52176. Inconsistencies when accessing protected members [Zend/tests/access_modifiers_008.phpt] XFAIL REASON: Discussion: http://marc.info/?l=php-internals&m=120221184420957&w=2 Inconsistencies when accessing protected members - 2 [Zend/tests/access_modifiers_009.phpt] XFAIL REASON: Discussion: http://marc.info/?l=php-internals&m=120221184420957&w=2 Bug #48770 (call_user_func_array() fails to call parent from inheriting class) [Zend/tests/bug48770.phpt] XFAIL REASON: See Bug #48770 Bug #48770 (call_user_func_array() fails to call parent from inheriting class) [Zend/tests/bug48770_2.phpt] XFAIL REASON: See Bug #48770 Bug #48770 (call_user_func_array() fails to call parent from inheriting class) [Zend/tests/bug48770_3.phpt] XFAIL REASON: See Bug #48770 Initial value of static var in method depends on the include time of the class definition [Zend/tests/method_static_var.phpt] XFAIL REASON: Maybe not a bug DateTime::add() -- fall type2 type3 [ext/date/tests/DateTime_add-fall-type2-type3.phpt] XFAIL REASON: Various bugs exist DateTime::add() -- fall type3 type2 [ext/date/tests/DateTime_add-fall-type3-type2.phpt] XFAIL REASON: Various bugs exist DateTime::add() -- fall type3 type3 [ext/date/tests/DateTime_add-fall-type3-type3.phpt] XFAIL REASON: Various bugs exist DateTime::add() -- spring type2 type3 [ext/date/tests/DateTime_add-spring-type2-type3.phpt] XFAIL REASON: Various bugs exist DateTime::add() -- spring type3 type2 [ext/date/tests/DateTime_add-spring-type3-type2.phpt] XFAIL REASON: Various bugs exist DateTime::add() -- spring type3 type3 [ext/date/tests/DateTime_add-spring-type3-type3.phpt] XFAIL REASON: Various bugs exist DateTime::diff() -- fall type2 type3 [ext/date/tests/DateTime_diff-fall-type2-type3.phpt] XFAIL REASON: Various bugs exist DateTime::diff() -- fall type3 type2 [ext/date/tests/DateTime_diff-fall-type3-type2.phpt] XFAIL REASON: Various bugs exist DateTime::diff() -- fall type3 type3 [ext/date/tests/DateTime_diff-fall-type3-type3.phpt] XFAIL REASON: Various bugs exist DateTime::diff() -- spring type2 type3 [ext/date/tests/DateTime_diff-spring-type2-type3.phpt] XFAIL REASON: Various bugs exist DateTime::diff() -- spring type3 type2 [ext/date/tests/DateTime_diff-spring-type3-type2.phpt] XFAIL REASON: Various bugs exist DateTime::diff() -- spring type3 type3 [ext/date/tests/DateTime_diff-spring-type3-type3.phpt] XFAIL REASON: Various bugs exist DateTime::sub() -- fall type2 type3 [ext/date/tests/DateTime_sub-fall-type2-type3.phpt] XFAIL REASON: Various bugs exist DateTime::sub() -- fall type3 type2 [ext/date/tests/DateTime_sub-fall-type3-type2.phpt] XFAIL REASON: Various bugs exist DateTime::sub() -- fall type3 type3 [ext/date/tests/DateTime_sub-fall-type3-type3.phpt] XFAIL REASON: Various bugs exist DateTime::sub() -- spring type2 type3 [ext/date/tests/DateTime_sub-spring-type2-type3.phpt] XFAIL REASON: Various bugs exist DateTime::sub() -- spring type3 type2 [ext/date/tests/DateTime_sub-spring-type3-type2.phpt] XFAIL REASON: Various bugs exist DateTime::sub() -- spring type3 type3 [ext/date/tests/DateTime_sub-spring-type3-type3.phpt] XFAIL REASON: Various bugs exist Bug #55407 (Impossible to prototype DateTime::createFromFormat) [ext/date/tests/bug55407.phpt] XFAIL REASON: Bug #55407 RFC: DateTime and Daylight Saving Time Transitions (zone type 3, bd2) [ext/date/tests/rfc-datetime_and_daylight_saving_time-type3-bd2.phpt] XFAIL REASON: Still not quite right RFC: DateTime and Daylight Saving Time Transitions (zone type 3, fs) [ext/date/tests/rfc-datetime_and_daylight_saving_time-type3-fs.phpt] XFAIL REASON: Still not quite right Bug #42718 (unsafe_raw filter not applied when configured as default filter) [ext/filter/tests/bug42718.phpt] XFAIL REASON: FILTER_UNSAFE_RAW not applied when configured as default filter, even with flags Bug #67296 (filter_input doesn't validate variables) [ext/filter/tests/bug49184.phpt] XFAIL REASON: See Bug #49184 Bug #67167: filter_var(null,FILTER_VALIDATE_BOOLEAN,FILTER_NULL_ON_FAILURE) returns null [ext/filter/tests/bug67167.02.phpt] XFAIL REASON: Requires php_zval_filter to not use convert_to_string for all filters. Phar: bug #69958: Segfault in Phar::convertToData on invalid file [ext/phar/tests/bug69958.phpt] XFAIL REASON: Still has memory leaks, see https://bugs.php.net/bug.php?id=70005 updateTimestamp never called when session data is empty [ext/session/tests/bug71162.phpt] XFAIL REASON: Current session module is designed to write empty session always. In addition, current session module only supports SessionHandlerInterface only from PHP 7.0. Bug #70219 Use after free vulnerability in session deserializer [ext/standard/tests/serialize/bug70219.phpt] XFAIL REASON: Unfinished merge, needs fix. Bug #70470 (Built-in server truncates headers spanning over TCP packets) [sapi/cli/tests/bug70470.phpt] XFAIL REASON: bug is not fixed yet ===================================================================== ===================================================================== FAILED TEST SUMMARY --------------------------------------------------------------------- Bug #64267 (CURLOPT_INFILE doesn't allow reset) [ext/curl/tests/bug64267.phpt] Bug #71523 (Copied handle with new option CURLOPT_HTTPHEADER crashes while curl_multi_exec) [ext/curl/tests/bug71523.phpt] Bug #70417 (PharData::compress() doesn't close temp file) [ext/phar/tests/tar/bug70417.phpt] int stream_socket_sendto ( resource $socket , string $data [, int $flags = 0 [, string $address ]] ); [ext/standard/tests/streams/stream_socket_sendto.phpt] ===================================================================== ===================================================================== WARNED TEST SUMMARY --------------------------------------------------------------------- FPM: Test status page [sapi/fpm/tests/010.phpt] (warn: XFAIL section but test passes) FPM: Test various messages on start, from master and childs [sapi/fpm/tests/015.phpt] (warn: XFAIL section but test passes) ===================================================================== ===================================================================== TEST RESULT SUMMARY --------------------------------------------------------------------- Exts skipped : 24 Exts tested : 50 --------------------------------------------------------------------- Number of tests : 15411 12323 Tests skipped : 3088 ( 20.0%) -------- Tests warned : 2 ( 0.0%) ( 0.0%) Tests failed : 4 ( 0.0%) ( 0.0%) Expected fail : 35 ( 0.2%) ( 0.3%) Tests passed : 12282 ( 79.7%) ( 99.7%) --------------------------------------------------------------------- Time taken : 2058 seconds ===================================================================== ===================================================================== EXPECTED FAILED TEST SUMMARY --------------------------------------------------------------------- Test open_basedir configuration [tests/security/open_basedir_linkinfo.phpt] XFAIL REASON: BUG: open_basedir cannot delete symlink to prohibited file. See also bugs 48111 and 52176. Inconsistencies when accessing protected members [Zend/tests/access_modifiers_008.phpt] XFAIL REASON: Discussion: http://marc.info/?l=php-internals&m=120221184420957&w=2 Inconsistencies when accessing protected members - 2 [Zend/tests/access_modifiers_009.phpt] XFAIL REASON: Discussion: http://marc.info/?l=php-internals&m=120221184420957&w=2 Bug #48770 (call_user_func_array() fails to call parent from inheriting class) [Zend/tests/bug48770.phpt] XFAIL REASON: See Bug #48770 Bug #48770 (call_user_func_array() fails to call parent from inheriting class) [Zend/tests/bug48770_2.phpt] XFAIL REASON: See Bug #48770 Bug #48770 (call_user_func_array() fails to call parent from inheriting class) [Zend/tests/bug48770_3.phpt] XFAIL REASON: See Bug #48770 Initial value of static var in method depends on the include time of the class definition [Zend/tests/method_static_var.phpt] XFAIL REASON: Maybe not a bug DateTime::add() -- fall type2 type3 [ext/date/tests/DateTime_add-fall-type2-type3.phpt] XFAIL REASON: Various bugs exist DateTime::add() -- fall type3 type2 [ext/date/tests/DateTime_add-fall-type3-type2.phpt] XFAIL REASON: Various bugs exist DateTime::add() -- fall type3 type3 [ext/date/tests/DateTime_add-fall-type3-type3.phpt] XFAIL REASON: Various bugs exist DateTime::add() -- spring type2 type3 [ext/date/tests/DateTime_add-spring-type2-type3.phpt] XFAIL REASON: Various bugs exist DateTime::add() -- spring type3 type2 [ext/date/tests/DateTime_add-spring-type3-type2.phpt] XFAIL REASON: Various bugs exist DateTime::add() -- spring type3 type3 [ext/date/tests/DateTime_add-spring-type3-type3.phpt] XFAIL REASON: Various bugs exist DateTime::diff() -- fall type2 type3 [ext/date/tests/DateTime_diff-fall-type2-type3.phpt] XFAIL REASON: Various bugs exist DateTime::diff() -- fall type3 type2 [ext/date/tests/DateTime_diff-fall-type3-type2.phpt] XFAIL REASON: Various bugs exist DateTime::diff() -- fall type3 type3 [ext/date/tests/DateTime_diff-fall-type3-type3.phpt] XFAIL REASON: Various bugs exist DateTime::diff() -- spring type2 type3 [ext/date/tests/DateTime_diff-spring-type2-type3.phpt] XFAIL REASON: Various bugs exist DateTime::diff() -- spring type3 type2 [ext/date/tests/DateTime_diff-spring-type3-type2.phpt] XFAIL REASON: Various bugs exist DateTime::diff() -- spring type3 type3 [ext/date/tests/DateTime_diff-spring-type3-type3.phpt] XFAIL REASON: Various bugs exist DateTime::sub() -- fall type2 type3 [ext/date/tests/DateTime_sub-fall-type2-type3.phpt] XFAIL REASON: Various bugs exist DateTime::sub() -- fall type3 type2 [ext/date/tests/DateTime_sub-fall-type3-type2.phpt] XFAIL REASON: Various bugs exist DateTime::sub() -- fall type3 type3 [ext/date/tests/DateTime_sub-fall-type3-type3.phpt] XFAIL REASON: Various bugs exist DateTime::sub() -- spring type2 type3 [ext/date/tests/DateTime_sub-spring-type2-type3.phpt] XFAIL REASON: Various bugs exist DateTime::sub() -- spring type3 type2 [ext/date/tests/DateTime_sub-spring-type3-type2.phpt] XFAIL REASON: Various bugs exist DateTime::sub() -- spring type3 type3 [ext/date/tests/DateTime_sub-spring-type3-type3.phpt] XFAIL REASON: Various bugs exist Bug #55407 (Impossible to prototype DateTime::createFromFormat) [ext/date/tests/bug55407.phpt] XFAIL REASON: Bug #55407 RFC: DateTime and Daylight Saving Time Transitions (zone type 3, bd2) [ext/date/tests/rfc-datetime_and_daylight_saving_time-type3-bd2.phpt] XFAIL REASON: Still not quite right RFC: DateTime and Daylight Saving Time Transitions (zone type 3, fs) [ext/date/tests/rfc-datetime_and_daylight_saving_time-type3-fs.phpt] XFAIL REASON: Still not quite right Bug #42718 (unsafe_raw filter not applied when configured as default filter) [ext/filter/tests/bug42718.phpt] XFAIL REASON: FILTER_UNSAFE_RAW not applied when configured as default filter, even with flags Bug #67296 (filter_input doesn't validate variables) [ext/filter/tests/bug49184.phpt] XFAIL REASON: See Bug #49184 Bug #67167: filter_var(null,FILTER_VALIDATE_BOOLEAN,FILTER_NULL_ON_FAILURE) returns null [ext/filter/tests/bug67167.02.phpt] XFAIL REASON: Requires php_zval_filter to not use convert_to_string for all filters. Phar: bug #69958: Segfault in Phar::convertToData on invalid file [ext/phar/tests/bug69958.phpt] XFAIL REASON: Still has memory leaks, see https://bugs.php.net/bug.php?id=70005 updateTimestamp never called when session data is empty [ext/session/tests/bug71162.phpt] XFAIL REASON: Current session module is designed to write empty session always. In addition, current session module only supports SessionHandlerInterface only from PHP 7.0. Bug #70219 Use after free vulnerability in session deserializer [ext/standard/tests/serialize/bug70219.phpt] XFAIL REASON: Unfinished merge, needs fix. Bug #70470 (Built-in server truncates headers spanning over TCP packets) [sapi/cli/tests/bug70470.phpt] XFAIL REASON: bug is not fixed yet ===================================================================== ===================================================================== FAILED TEST SUMMARY --------------------------------------------------------------------- Bug #64267 (CURLOPT_INFILE doesn't allow reset) [ext/curl/tests/bug64267.phpt] Bug #71523 (Copied handle with new option CURLOPT_HTTPHEADER crashes while curl_multi_exec) [ext/curl/tests/bug71523.phpt] Bug #70417 (PharData::compress() doesn't close temp file) [ext/phar/tests/tar/bug70417.phpt] int stream_socket_sendto ( resource $socket , string $data [, int $flags = 0 [, string $address ]] ); [ext/standard/tests/streams/stream_socket_sendto.phpt] ===================================================================== ===================================================================== WARNED TEST SUMMARY --------------------------------------------------------------------- FPM: Test status page [sapi/fpm/tests/010.phpt] (warn: XFAIL section but test passes) FPM: Test various messages on start, from master and childs [sapi/fpm/tests/015.phpt] (warn: XFAIL section but test passes) ===================================================================== ================================================================================ /home/zolf/src/php-7.1.4/ext/curl/tests/bug64267.phpt ================================================================================ TEST bool(true) bool(true) int(0) ===DONE=== ================================================================================ 004+ int(0) 004- int(30%d) ================================================================================ ================================================================================ /home/zolf/src/php-7.1.4/ext/curl/tests/bug71523.phpt ================================================================================ ** ERROR: process timed out ** ================================================================================ 001+ ** ERROR: process timed out ** 001- okey ================================================================================ ================================================================================ /home/zolf/src/php-7.1.4/ext/phar/tests/tar/bug70417.phpt ================================================================================ lsof: WARNING: can't stat() fuse.gvfsd-fuse file system /run/user/108/gvfs Output information may be incomplete. lsof: WARNING: can't stat() fuse.gvfsd-fuse file system /run/user/108/gvfs Output information may be incomplete. bool(true) ================================================================================ 001+ lsof: WARNING: can't stat() fuse.gvfsd-fuse file system /run/user/108/gvfs 002+ Output information may be incomplete. 003+ lsof: WARNING: can't stat() fuse.gvfsd-fuse file system /run/user/108/gvfs 004+ Output information may be incomplete. ================================================================================ ================================================================================ /home/zolf/src/php-7.1.4/ext/standard/tests/streams/stream_socket_sendto.phpt ================================================================================ Notice: fwrite(): send of 23 bytes failed with errno=32 Broken pipe in /home/zolf/src/php-7.1.4/ext/standard/tests/streams/stream_socket_sendto.php on line 9 Warning: stream_socket_sendto() expects at least 2 parameters, 0 given in /home/zolf/src/php-7.1.4/ext/standard/tests/streams/stream_socket_sendto.php on line 10 bool(false) Warning: stream_socket_sendto() expects at least 2 parameters, 1 given in /home/zolf/src/php-7.1.4/ext/standard/tests/streams/stream_socket_sendto.php on line 11 bool(false) Warning: stream_socket_sendto(): Broken pipe in /home/zolf/src/php-7.1.4/ext/standard/tests/streams/stream_socket_sendto.php on line 12 int(-1) Warning: stream_socket_sendto(): Broken pipe in /home/zolf/src/php-7.1.4/ext/standard/tests/streams/stream_socket_sendto.php on line 13 int(-1) Warning: stream_socket_sendto(): php_network_getaddresses: getaddrinfo failed: No address associated with hostname in /home/zolf/src/php-7.1.4/ext/standard/tests/streams/stream_socket_sendto.php on line 14 Warning: stream_socket_sendto(): Failed to resolve `tcp': php_network_getaddresses: getaddrinfo failed: No address associated with hostname in /home/zolf/src/php-7.1.4/ext/standard/tests/streams/stream_socket_sendto.php on line 14 Warning: stream_socket_sendto(): Failed to parse `tcp://127.0.0.1:31854' into a valid network address in /home/zolf/src/php-7.1.4/ext/standard/tests/streams/stream_socket_sendto.php on line 14 bool(false) Warning: stream_socket_sendto(): php_network_getaddresses: getaddrinfo failed: No address associated with hostname in /home/zolf/src/php-7.1.4/ext/standard/tests/streams/stream_socket_sendto.php on line 15 Warning: stream_socket_sendto(): Failed to resolve `http': php_network_getaddresses: getaddrinfo failed: No address associated with hostname in /home/zolf/src/php-7.1.4/ext/standard/tests/streams/stream_socket_sendto.php on line 15 Warning: stream_socket_sendto(): Failed to parse `http://php.net' into a valid network address in /home/zolf/src/php-7.1.4/ext/standard/tests/streams/stream_socket_sendto.php on line 15 bool(false) ================================================================================ 017+ Warning: stream_socket_sendto(): php_network_getaddresses: getaddrinfo failed: No address associated with hostname in /home/zolf/src/php-7.1.4/ext/standard/tests/streams/stream_socket_sendto.php on line 14 017- Warning: stream_socket_sendto(): php_network_getaddresses: getaddrinfo failed: Name or service not known in %s on line %i 019+ Warning: stream_socket_sendto(): Failed to resolve `tcp': php_network_getaddresses: getaddrinfo failed: No address associated with hostname in /home/zolf/src/php-7.1.4/ext/standard/tests/streams/stream_socket_sendto.php on line 14 019- Warning: stream_socket_sendto(): Failed to resolve %s: php_network_getaddresses: getaddrinfo failed: Name or service not known in %s on line %i 024+ Warning: stream_socket_sendto(): php_network_getaddresses: getaddrinfo failed: No address associated with hostname in /home/zolf/src/php-7.1.4/ext/standard/tests/streams/stream_socket_sendto.php on line 15 024- Warning: stream_socket_sendto(): php_network_getaddresses: getaddrinfo failed: Name or service not known in %s on line %i 026+ Warning: stream_socket_sendto(): Failed to resolve `http': php_network_getaddresses: getaddrinfo failed: No address associated with hostname in /home/zolf/src/php-7.1.4/ext/standard/tests/streams/stream_socket_sendto.php on line 15 026- Warning: stream_socket_sendto(): Failed to resolve %s: php_network_getaddresses: getaddrinfo failed: Name or service not known in %s on line %i ================================================================================ ================================================================================ BUILD ENVIRONMENT ================================================================================ OS: Linux - Linux minipc 4.4.0-72-generic #93-Ubuntu SMP Fri Mar 31 14:07:41 UTC 2017 x86_64 Autoconf: Bundled Libtool: ltmain.sh (GNU libtool) 1.5.26 (1.1220.2.492 2008/01/30 06:40:56) Copyright (C) 2008 Free Software Foundation, Inc. This is free software; see the source for copying conditions. There is NO warranty; not even for MERCHANTABILITY or FITNESS FOR A PARTICULAR PURPOSE. System Libtool: N/A Compiler: Using built-in specs. COLLECT_GCC=cc COLLECT_LTO_WRAPPER=/usr/lib/gcc/x86_64-linux-gnu/5/lto-wrapper Target: x86_64-linux-gnu Configured with: ../src/configure -v --with-pkgversion='Ubuntu 5.4.0-6ubuntu1~16.04.4' --with-bugurl=file:///usr/share/doc/gcc-5/README.Bugs --enable-languages=c,ada,c++,java,go,d,fortran,objc,obj-c++ --prefix=/usr --program-suffix=-5 --enable-shared --enable-linker-build-id --libexecdir=/usr/lib --without-included-gettext --enable-threads=posix --libdir=/usr/lib --enable-nls --with-sysroot=/ --enable-clocale=gnu --enable-libstdcxx-debug --enable-libstdcxx-time=yes --with-default-libstdcxx-abi=new --enable-gnu-unique-object --disable-vtable-verify --enable-libmpx --enable-plugin --with-system-zlib --disable-browser-plugin --enable-java-awt=gtk --enable-gtk-cairo --with-java-home=/usr/lib/jvm/java-1.5.0-gcj-5-amd64/jre --enable-java-home --with-jvm-root-dir=/usr/lib/jvm/java-1.5.0-gcj-5-amd64 --with-jvm-jar-dir=/usr/lib/jvm-exports/java-1.5.0-gcj-5-amd64 --with-arch-directory=amd64 --with-ecj-jar=/usr/share/java/eclipse-ecj.jar --enable-objc-gc --enable-multiarch --disable-werror --with-arch-32=i686 --with-abi=m64 --with-multilib-list=m32,m64,mx32 --enable-multilib --with-tune=generic --enable-checking=release --build=x86_64-linux-gnu --host=x86_64-linux-gnu --target=x86_64-linux-gnu Thread model: posix gcc version 5.4.0 20160609 (Ubuntu 5.4.0-6ubuntu1~16.04.4) Bison: Libraries: linux-vdso.so.1 => (0x00007ffc9a3e5000) libz.so.1 => /lib/x86_64-linux-gnu/libz.so.1 (0x00007fd625e57000) libexslt.so.0 => /usr/lib/x86_64-linux-gnu/libexslt.so.0 (0x00007fd625c42000) libresolv.so.2 => /lib/x86_64-linux-gnu/libresolv.so.2 (0x00007fd625a26000) libaspell.so.15 => /usr/lib/x86_64-linux-gnu/libaspell.so.15 (0x00007fd62577c000) libpq.so.5 => /usr/local/pgsql/lib/libpq.so.5 (0x00007fd62554e000) libmcrypt.so.4 => /usr/lib/libmcrypt.so.4 (0x00007fd625319000) libstdc++.so.6 => /usr/lib/x86_64-linux-gnu/libstdc++.so.6 (0x00007fd624f97000) libpng12.so.0 => /usr/lib/x86_64-linux-gnu/libpng12.so.0 (0x00007fd624d72000) libjpeg.so.8 => /usr/lib/x86_64-linux-gnu/libjpeg.so.8 (0x00007fd624b18000) libwebp.so.5 => /usr/lib/x86_64-linux-gnu/libwebp.so.5 (0x00007fd6248bc000) libbz2.so.1.0 => /lib/x86_64-linux-gnu/libbz2.so.1.0 (0x00007fd6246ac000) libm.so.6 => /lib/x86_64-linux-gnu/libm.so.6 (0x00007fd6243a2000) libdl.so.2 => /lib/x86_64-linux-gnu/libdl.so.2 (0x00007fd62419e000) libxml2.so.2 => /usr/lib/x86_64-linux-gnu/libxml2.so.2 (0x00007fd623de3000) libssl.so.1.0.0 => /lib/x86_64-linux-gnu/libssl.so.1.0.0 (0x00007fd623b79000) libcrypto.so.1.0.0 => /lib/x86_64-linux-gnu/libcrypto.so.1.0.0 (0x00007fd623735000) libcurl.so.4 => /usr/lib/x86_64-linux-gnu/libcurl.so.4 (0x00007fd6234c6000) libfreetype.so.6 => /usr/lib/x86_64-linux-gnu/libfreetype.so.6 (0x00007fd62321b000) libicui18n.so.55 => /usr/lib/x86_64-linux-gnu/libicui18n.so.55 (0x00007fd622db9000) libicuuc.so.55 => /usr/lib/x86_64-linux-gnu/libicuuc.so.55 (0x00007fd622a25000) libicuio.so.55 => /usr/lib/x86_64-linux-gnu/libicuio.so.55 (0x00007fd622816000) libxslt.so.1 => /usr/lib/x86_64-linux-gnu/libxslt.so.1 (0x00007fd6225d9000) libgcc_s.so.1 => /lib/x86_64-linux-gnu/libgcc_s.so.1 (0x00007fd6223c3000) libc.so.6 => /lib/x86_64-linux-gnu/libc.so.6 (0x00007fd621ff9000) libgcrypt.so.20 => /lib/x86_64-linux-gnu/libgcrypt.so.20 (0x00007fd621d18000) libpthread.so.0 => /lib/x86_64-linux-gnu/libpthread.so.0 (0x00007fd621afb000) /lib64/ld-linux-x86-64.so.2 (0x00005595807d0000) liblzma.so.5 => /lib/x86_64-linux-gnu/liblzma.so.5 (0x00007fd6218d8000) libidn.so.11 => /usr/lib/x86_64-linux-gnu/libidn.so.11 (0x00007fd6216a5000) librtmp.so.1 => /usr/lib/x86_64-linux-gnu/librtmp.so.1 (0x00007fd621488000) libgssapi_krb5.so.2 => /usr/lib/x86_64-linux-gnu/libgssapi_krb5.so.2 (0x00007fd62123e000) liblber-2.4.so.2 => /usr/lib/x86_64-linux-gnu/liblber-2.4.so.2 (0x00007fd62102f000) libldap_r-2.4.so.2 => /usr/lib/x86_64-linux-gnu/libldap_r-2.4.so.2 (0x00007fd620ddd000) libicudata.so.55 => /usr/lib/x86_64-linux-gnu/libicudata.so.55 (0x00007fd61f326000) libgpg-error.so.0 => /lib/x86_64-linux-gnu/libgpg-error.so.0 (0x00007fd61f111000) libgnutls.so.30 => /usr/lib/x86_64-linux-gnu/libgnutls.so.30 (0x00007fd61ede1000) libhogweed.so.4 => /usr/lib/x86_64-linux-gnu/libhogweed.so.4 (0x00007fd61ebae000) libnettle.so.6 => /usr/lib/x86_64-linux-gnu/libnettle.so.6 (0x00007fd61e977000) libgmp.so.10 => /usr/lib/x86_64-linux-gnu/libgmp.so.10 (0x00007fd61e6f7000) libkrb5.so.3 => /usr/lib/x86_64-linux-gnu/libkrb5.so.3 (0x00007fd61e425000) libk5crypto.so.3 => /usr/lib/x86_64-linux-gnu/libk5crypto.so.3 (0x00007fd61e1f5000) libcom_err.so.2 => /lib/x86_64-linux-gnu/libcom_err.so.2 (0x00007fd61dff1000) libkrb5support.so.0 => /usr/lib/x86_64-linux-gnu/libkrb5support.so.0 (0x00007fd61dde6000) libsasl2.so.2 => /usr/lib/x86_64-linux-gnu/libsasl2.so.2 (0x00007fd61dbca000) libgssapi.so.3 => /usr/lib/x86_64-linux-gnu/libgssapi.so.3 (0x00007fd61d989000) libp11-kit.so.0 => /usr/lib/x86_64-linux-gnu/libp11-kit.so.0 (0x00007fd61d725000) libtasn1.so.6 => /usr/lib/x86_64-linux-gnu/libtasn1.so.6 (0x00007fd61d511000) libkeyutils.so.1 => /lib/x86_64-linux-gnu/libkeyutils.so.1 (0x00007fd61d30d000) libheimntlm.so.0 => /usr/lib/x86_64-linux-gnu/libheimntlm.so.0 (0x00007fd61d103000) libkrb5.so.26 => /usr/lib/x86_64-linux-gnu/libkrb5.so.26 (0x00007fd61ce79000) libasn1.so.8 => /usr/lib/x86_64-linux-gnu/libasn1.so.8 (0x00007fd61cbd7000) libhcrypto.so.4 => /usr/lib/x86_64-linux-gnu/libhcrypto.so.4 (0x00007fd61c9a3000) libroken.so.18 => /usr/lib/x86_64-linux-gnu/libroken.so.18 (0x00007fd61c78d000) libffi.so.6 => /usr/lib/x86_64-linux-gnu/libffi.so.6 (0x00007fd61c585000) libwind.so.0 => /usr/lib/x86_64-linux-gnu/libwind.so.0 (0x00007fd61c35b000) libheimbase.so.1 => /usr/lib/x86_64-linux-gnu/libheimbase.so.1 (0x00007fd61c14c000) libhx509.so.5 => /usr/lib/x86_64-linux-gnu/libhx509.so.5 (0x00007fd61bf01000) libsqlite3.so.0 => /usr/lib/x86_64-linux-gnu/libsqlite3.so.0 (0x00007fd61bc2b000) libcrypt.so.1 => /lib/x86_64-linux-gnu/libcrypt.so.1 (0x00007fd61b9f3000) ================================================================================ PHPINFO ================================================================================ phpinfo() PHP Version => 7.1.4 System => Linux minipc 4.4.0-72-generic #93-Ubuntu SMP Fri Mar 31 14:07:41 UTC 2017 x86_64 Build Date => Apr 18 2017 10:28:48 Configure Command => './configure' '--prefix=/usr/local/php7' '--with-openssl' '--with-curl' '--with-zlib' '--with-bz2' '--with-gd' '--with-jpeg-dir' '--with-png-dir' '--with-webp-dir' '--with-freetype-dir' '--with-gettext' '--with-pgsql=/usr/local/pgsql' '--with-pdo-pgsql' '--with-libdir=lib64' '--with-mcrypt' '--with-kerberos' '--with-xsl' '--with-xmlrpc' '--enable-fpm' '--with-fpm-systemd' '--enable-libxml' '--enable-xml' '--enable-zip' '--enable-exif' '--enable-intl' '--enable-mbstring' '--enable-mbregex' '--enable-bcmath' '--enable-calendar' '--with-pspell' '--enable-pcntl' '--enable-shmop' '--enable-sockets' '--enable-sysvsem' '--enable-sysvshm' '--enable-sysvmsg' '--enable-inline-optimization' Server API => Command Line Interface Virtual Directory Support => disabled Configuration File (php.ini) Path => /usr/local/php7/lib Loaded Configuration File => (none) Scan this dir for additional .ini files => (none) Additional .ini files parsed => (none) PHP API => 20160303 PHP Extension => 20160303 Zend Extension => 320160303 Zend Extension Build => API320160303,NTS PHP Extension Build => API20160303,NTS Debug Build => no Thread Safety => disabled Zend Signal Handling => enabled Zend Memory Manager => enabled Zend Multibyte Support => provided by mbstring IPv6 Support => enabled DTrace Support => disabled Registered PHP Streams => https, ftps, compress.zlib, compress.bzip2, php, file, glob, data, http, ftp, phar, zip Registered Stream Socket Transports => tcp, udp, unix, udg, ssl, tls, tlsv1.0, tlsv1.1, tlsv1.2 Registered Stream Filters => zlib.*, bzip2.*, convert.iconv.*, mcrypt.*, mdecrypt.*, string.rot13, string.toupper, string.tolower, string.strip_tags, convert.*, consumed, dechunk This program makes use of the Zend Scripting Language Engine: Zend Engine v3.1.0, Copyright (c) 1998-2017 Zend Technologies _______________________________________________________________________ Configuration bcmath BCMath support => enabled Directive => Local Value => Master Value bcmath.scale => 0 => 0 bz2 BZip2 Support => Enabled Stream Wrapper support => compress.bzip2:// Stream Filter support => bzip2.decompress, bzip2.compress BZip2 Version => 1.0.6, 6-Sept-2010 calendar Calendar support => enabled Core PHP Version => 7.1.4 Directive => Local Value => Master Value allow_url_fopen => On => On allow_url_include => Off => Off arg_separator.input => & => & arg_separator.output => & => & auto_append_file => no value => no value auto_globals_jit => On => On auto_prepend_file => no value => no value browscap => no value => no value default_charset => UTF-8 => UTF-8 default_mimetype => text/html => text/html disable_classes => no value => no value disable_functions => no value => no value display_errors => STDERR => STDERR display_startup_errors => Off => Off doc_root => no value => no value docref_ext => no value => no value docref_root => no value => no value enable_dl => On => On enable_post_data_reading => On => On error_append_string => no value => no value error_log => no value => no value error_prepend_string => no value => no value error_reporting => no value => no value expose_php => On => On extension_dir => /usr/local/php7/lib/php/extensions/no-debug-non-zts-20160303 => /usr/local/php7/lib/php/extensions/no-debug-non-zts-20160303 file_uploads => On => On hard_timeout => 2 => 2 highlight.comment => <font style="color: #FF8000">#FF8000</font> => <font style="color: #FF8000">#FF8000</font> highlight.default => <font style="color: #0000BB">#0000BB</font> => <font style="color: #0000BB">#0000BB</font> highlight.html => <font style="color: #000000">#000000</font> => <font style="color: #000000">#000000</font> highlight.keyword => <font style="color: #007700">#007700</font> => <font style="color: #007700">#007700</font> highlight.string => <font style="color: #DD0000">#DD0000</font> => <font style="color: #DD0000">#DD0000</font> html_errors => Off => Off ignore_repeated_errors => Off => Off ignore_repeated_source => Off => Off ignore_user_abort => Off => Off implicit_flush => On => On include_path => .:/usr/local/php7/lib/php => .:/usr/local/php7/lib/php input_encoding => no value => no value internal_encoding => no value => no value log_errors => Off => Off log_errors_max_len => 1024 => 1024 mail.add_x_header => Off => Off mail.force_extra_parameters => no value => no value mail.log => no value => no value max_execution_time => 0 => 0 max_file_uploads => 20 => 20 max_input_nesting_level => 64 => 64 max_input_time => -1 => -1 max_input_vars => 1000 => 1000 memory_limit => 128M => 128M open_basedir => no value => no value output_buffering => 0 => 0 output_encoding => no value => no value output_handler => no value => no value post_max_size => 8M => 8M precision => 14 => 14 realpath_cache_size => 4096K => 4096K realpath_cache_ttl => 120 => 120 register_argc_argv => On => On report_memleaks => On => On report_zend_debug => Off => Off request_order => no value => no value sendmail_from => no value => no value sendmail_path => -t -i => -t -i serialize_precision => -1 => -1 short_open_tag => On => On SMTP => localhost => localhost smtp_port => 25 => 25 sql.safe_mode => Off => Off sys_temp_dir => no value => no value track_errors => Off => Off unserialize_callback_func => no value => no value upload_max_filesize => 2M => 2M upload_tmp_dir => no value => no value user_dir => no value => no value user_ini.cache_ttl => 300 => 300 user_ini.filename => .user.ini => .user.ini variables_order => EGPCS => EGPCS xmlrpc_error_number => 0 => 0 xmlrpc_errors => Off => Off zend.assertions => 1 => 1 zend.detect_unicode => On => On zend.enable_gc => On => On zend.multibyte => Off => Off zend.script_encoding => no value => no value zend.signal_check => Off => Off ctype ctype functions => enabled curl cURL support => enabled cURL Information => 7.47.0 Age => 3 Features AsynchDNS => Yes CharConv => No Debug => No GSS-Negotiate => No IDN => Yes IPv6 => Yes krb4 => No Largefile => Yes libz => Yes NTLM => Yes NTLMWB => Yes SPNEGO => Yes SSL => Yes SSPI => No TLS-SRP => Yes HTTP2 => No GSSAPI => Yes KERBEROS5 => Yes UNIX_SOCKETS => Yes PSL => No Protocols => dict, file, ftp, ftps, gopher, http, https, imap, imaps, ldap, ldaps, pop3, pop3s, rtmp, rtsp, smb, smbs, smtp, smtps, telnet, tftp Host => x86_64-pc-linux-gnu SSL Version => OpenSSL/1.0.2g ZLib Version => 1.2.8 date date/time support => enabled "Olson" Timezone Database Version => 2017.2 Timezone Database => internal Default timezone => UTC Directive => Local Value => Master Value date.default_latitude => 31.7667 => 31.7667 date.default_longitude => 35.2333 => 35.2333 date.sunrise_zenith => 90.583333 => 90.583333 date.sunset_zenith => 90.583333 => 90.583333 date.timezone => no value => no value dom DOM/XML => enabled DOM/XML API Version => 20031129 libxml Version => 2.9.3 HTML Support => enabled XPath Support => enabled XPointer Support => enabled Schema Support => enabled RelaxNG Support => enabled exif EXIF Support => enabled EXIF Version => 1.4 $Id: 8bdc0c8f27c2c9dd1f7551f1f9fe3ab57a06a4b1 $ Supported EXIF Version => 0220 Supported filetypes => JPEG,TIFF Directive => Local Value => Master Value exif.decode_jis_intel => JIS => JIS exif.decode_jis_motorola => JIS => JIS exif.decode_unicode_intel => UCS-2LE => UCS-2LE exif.decode_unicode_motorola => UCS-2BE => UCS-2BE exif.encode_jis => no value => no value exif.encode_unicode => ISO-8859-15 => ISO-8859-15 fileinfo fileinfo support => enabled version => 1.0.5 libmagic => 522 filter Input Validation and Filtering => enabled Revision => $Id: cdc5e15bb616f10210b94ecd8789e66c927a375f $ Directive => Local Value => Master Value filter.default => unsafe_raw => unsafe_raw filter.default_flags => no value => no value gd GD Support => enabled GD Version => bundled (2.1.0 compatible) FreeType Support => enabled FreeType Linkage => with freetype FreeType Version => 2.6.1 GIF Read Support => enabled GIF Create Support => enabled JPEG Support => enabled libJPEG Version => 8 PNG Support => enabled libPNG Version => 1.2.54 WBMP Support => enabled XBM Support => enabled WebP Support => enabled Directive => Local Value => Master Value gd.jpeg_ignore_warning => 1 => 1 gettext GetText Support => enabled hash hash support => enabled Hashing Engines => md2 md4 md5 sha1 sha224 sha256 sha384 sha512/224 sha512/256 sha512 sha3-224 sha3-256 sha3-384 sha3-512 ripemd128 ripemd160 ripemd256 ripemd320 whirlpool tiger128,3 tiger160,3 tiger192,3 tiger128,4 tiger160,4 tiger192,4 snefru snefru256 gost gost-crypto adler32 crc32 crc32b fnv132 fnv1a32 fnv164 fnv1a64 joaat haval128,3 haval160,3 haval192,3 haval224,3 haval256,3 haval128,4 haval160,4 haval192,4 haval224,4 haval256,4 haval128,5 haval160,5 haval192,5 haval224,5 haval256,5 iconv iconv support => enabled iconv implementation => glibc iconv library version => 2.23 Directive => Local Value => Master Value iconv.input_encoding => no value => no value iconv.internal_encoding => no value => no value iconv.output_encoding => no value => no value intl Internationalization support => enabled version => 1.1.0 ICU version => 55.1 ICU Data version => 55.1 Directive => Local Value => Master Value intl.default_locale => no value => no value intl.error_level => 0 => 0 intl.use_exceptions => 0 => 0 json json support => enabled json version => 1.5.0 libxml libXML support => active libXML Compiled Version => 2.9.3 libXML Loaded Version => 20903 libXML streams => enabled mbstring Multibyte Support => enabled Multibyte string engine => libmbfl HTTP input encoding translation => disabled libmbfl version => 1.3.2 oniguruma version => 5.9.6 mbstring extension makes use of "streamable kanji code filter and converter", which is distributed under the GNU Lesser General Public License version 2.1. Multibyte (japanese) regex support => enabled Multibyte regex (oniguruma) backtrack check => On Multibyte regex (oniguruma) version => 5.9.6 Directive => Local Value => Master Value mbstring.detect_order => no value => no value mbstring.encoding_translation => Off => Off mbstring.func_overload => 0 => 0 mbstring.http_input => no value => no value mbstring.http_output => no value => no value mbstring.http_output_conv_mimetypes => ^(text/|application/xhtml\+xml) => ^(text/|application/xhtml\+xml) mbstring.internal_encoding => no value => no value mbstring.language => neutral => neutral mbstring.strict_detection => Off => Off mbstring.substitute_character => no value => no value mcrypt mcrypt support => enabled mcrypt_filter support => enabled Version => 2.5.8 Api No => 20021217 Supported ciphers => cast-128 gost rijndael-128 twofish arcfour cast-256 loki97 rijndael-192 saferplus wake blowfish-compat des rijndael-256 serpent xtea blowfish enigma rc2 tripledes Supported modes => cbc cfb ctr ecb ncfb nofb ofb stream Directive => Local Value => Master Value mcrypt.algorithms_dir => no value => no value mcrypt.modes_dir => no value => no value openssl OpenSSL support => enabled OpenSSL Library Version => OpenSSL 1.0.2g 1 Mar 2016 OpenSSL Header Version => OpenSSL 1.0.2g 1 Mar 2016 Openssl default config => /usr/lib/ssl/openssl.cnf Directive => Local Value => Master Value openssl.cafile => no value => no value openssl.capath => no value => no value pcntl pcntl support => enabled pcre PCRE (Perl Compatible Regular Expressions) Support => enabled PCRE Library Version => 8.38 2015-11-23 PCRE JIT Support => enabled Directive => Local Value => Master Value pcre.backtrack_limit => 1000000 => 1000000 pcre.jit => 1 => 1 pcre.recursion_limit => 100000 => 100000 PDO PDO support => enabled PDO drivers => pgsql, sqlite pdo_pgsql PDO Driver for PostgreSQL => enabled PostgreSQL(libpq) Version => 9.6.2 Module version => 7.1.4 Revision => $Id: 93712a6af603ebb2ee5792c5be271d4d03edfbde $ pdo_sqlite PDO Driver for SQLite 3.x => enabled SQLite Library => 3.15.1 pgsql PostgreSQL Support => enabled PostgreSQL(libpq) Version => 9.6.2 PostgreSQL(libpq) => PostgreSQL 9.6.2 on x86_64-pc-linux-gnu, compiled by gcc (Ubuntu 5.4.0-6ubuntu1~16.04.4) 5.4.0 20160609, 64-bit Multibyte character support => enabled SSL support => enabled Active Persistent Links => 0 Active Links => 0 Directive => Local Value => Master Value pgsql.allow_persistent => On => On pgsql.auto_reset_persistent => Off => Off pgsql.ignore_notice => Off => Off pgsql.log_notice => Off => Off pgsql.max_links => Unlimited => Unlimited pgsql.max_persistent => Unlimited => Unlimited Phar Phar: PHP Archive support => enabled Phar EXT version => 2.0.2 Phar API version => 1.1.1 SVN revision => $Id: 59c11f4e29768bfbbf6f41cb469abd81d8655850 $ Phar-based phar archives => enabled Tar-based phar archives => enabled ZIP-based phar archives => enabled gzip compression => enabled bzip2 compression => enabled Native OpenSSL support => enabled Phar based on pear/PHP_Archive, original concept by Davey Shafik. Phar fully realized by Gregory Beaver and Marcus Boerger. Portions of tar implementation Copyright (c) 2003-2009 Tim Kientzle. Directive => Local Value => Master Value phar.cache_list => no value => no value phar.readonly => On => On phar.require_hash => On => On posix Revision => $Id: b691ca925e7a085e6929579c4eba8fed0732e0ef $ pspell PSpell Support => enabled Reflection Reflection => enabled Version => $Id: a06522d025b0af3e6ba10a0f6964086b7e6f5458 $ session Session Support => enabled Registered save handlers => files user Registered serializer handlers => php_serialize php php_binary Directive => Local Value => Master Value session.auto_start => Off => Off session.cache_expire => 180 => 180 session.cache_limiter => nocache => nocache session.cookie_domain => no value => no value session.cookie_httponly => Off => Off session.cookie_lifetime => 0 => 0 session.cookie_path => / => / session.cookie_secure => Off => Off session.gc_divisor => 100 => 100 session.gc_maxlifetime => 1440 => 1440 session.gc_probability => 1 => 1 session.lazy_write => On => On session.name => PHPSESSID => PHPSESSID session.referer_check => no value => no value session.save_handler => files => files session.save_path => no value => no value session.serialize_handler => php => php session.sid_bits_per_character => 4 => 4 session.sid_length => 32 => 32 session.upload_progress.cleanup => On => On session.upload_progress.enabled => On => On session.upload_progress.freq => 1% => 1% session.upload_progress.min_freq => 1 => 1 session.upload_progress.name => PHP_SESSION_UPLOAD_PROGRESS => PHP_SESSION_UPLOAD_PROGRESS session.upload_progress.prefix => upload_progress_ => upload_progress_ session.use_cookies => On => On session.use_only_cookies => On => On session.use_strict_mode => Off => Off session.use_trans_sid => 0 => 0 shmop shmop support => enabled SimpleXML Simplexml support => enabled Revision => $Id: 7e5516dcdf2fe6ded7970eaeb6abd8d07df39a2a $ Schema support => enabled sockets Sockets Support => enabled SPL SPL support => enabled Interfaces => Countable, OuterIterator, RecursiveIterator, SeekableIterator, SplObserver, SplSubject Classes => AppendIterator, ArrayIterator, ArrayObject, BadFunctionCallException, BadMethodCallException, CachingIterator, CallbackFilterIterator, DirectoryIterator, DomainException, EmptyIterator, FilesystemIterator, FilterIterator, GlobIterator, InfiniteIterator, InvalidArgumentException, IteratorIterator, LengthException, LimitIterator, LogicException, MultipleIterator, NoRewindIterator, OutOfBoundsException, OutOfRangeException, OverflowException, ParentIterator, RangeException, RecursiveArrayIterator, RecursiveCachingIterator, RecursiveCallbackFilterIterator, RecursiveDirectoryIterator, RecursiveFilterIterator, RecursiveIteratorIterator, RecursiveRegexIterator, RecursiveTreeIterator, RegexIterator, RuntimeException, SplDoublyLinkedList, SplFileInfo, SplFileObject, SplFixedArray, SplHeap, SplMinHeap, SplMaxHeap, SplObjectStorage, SplPriorityQueue, SplQueue, SplStack, SplTempFileObject, UnderflowException, UnexpectedValueException sqlite3 SQLite3 support => enabled SQLite3 module version => 0.7-dev SQLite Library => 3.15.1 Directive => Local Value => Master Value sqlite3.extension_dir => no value => no value standard Dynamic Library Support => enabled Path to sendmail => -t -i Directive => Local Value => Master Value assert.active => 1 => 1 assert.bail => 0 => 0 assert.callback => no value => no value assert.exception => 0 => 0 assert.quiet_eval => 0 => 0 assert.warning => 1 => 1 auto_detect_line_endings => 0 => 0 default_socket_timeout => 60 => 60 from => no value => no value session.trans_sid_hosts => no value => no value session.trans_sid_tags => a=href,area=href,frame=src,form= => a=href,area=href,frame=src,form= url_rewriter.hosts => no value => no value url_rewriter.tags => form= => form= user_agent => no value => no value sysvmsg sysvmsg support => enabled Revision => $Id: 37aa0d90288b1385356784f17694f4c700575736 $ sysvsem Version => 7.1.4 sysvshm Version => 7.1.4 tokenizer Tokenizer Support => enabled xml XML Support => active XML Namespace Support => active libxml2 Version => 2.9.3 xmlreader XMLReader => enabled xmlrpc core library version => xmlrpc-epi v. 0.51 php extension version => 7.1.4 author => Dan Libby homepage => http://xmlrpc-epi.sourceforge.net open sourced by => Epinions.com xmlwriter XMLWriter => enabled xsl XSL => enabled libxslt Version => 1.1.28 libxslt compiled against libxml Version => 2.9.2 EXSLT => enabled libexslt Version => 1.1.28 zip Zip => enabled Zip version => 1.13.5 Libzip version => 1.1.2 zlib ZLib Support => enabled Stream Wrapper => compress.zlib:// Stream Filter => zlib.inflate, zlib.deflate Compiled Version => 1.2.8 Linked Version => 1.2.8 Directive => Local Value => Master Value zlib.output_compression => Off => Off zlib.output_compression_level => -1 => -1 zlib.output_handler => no value => no value Additional Modules Module Name Environment Variable => Value PYENV_VIRTUALENV_INIT => 1 LESSOPEN => | /usr/bin/lesspipe %s MAIL => /var/mail/zolf SSH_CLIENT => deleted USER => zolf LC_TIME => zh_CN.UTF-8 SHLVL => 2 TEST_PHP_SRCDIR => /home/zolf/src/php-7.1.4 HOME => /home/zolf SSH_TTY => deleted NVM_NODEJS_ORG_MIRROR => https://nodejs.org/dist NVM_BIN => /home/zolf/.nvm/versions/node/v6.9.2/bin PYENV_SHELL => bash LC_MONETARY => zh_CN.UTF-8 MAKEFLAGS => -j --jobserver-fds=3,4 NVM_PATH => /home/zolf/.nvm/versions/node/v6.9.2/lib/node NVM_DIR => /home/zolf/.nvm MAKE_TERMERR => /dev/pts/11 QT_QPA_PLATFORMTHEME => appmenu-qt5 LOGNAME => zolf TEST_PHP_EXECUTABLE => /home/zolf/src/php-7.1.4/sapi/cli/php _ => /home/zolf/src/php-7.1.4/sapi/cli/php XDG_SESSION_ID => 101 TERM => xterm-256color RBENV_SHELL => bash PATH => /usr/local/pgsql/bin:/home/zolf/.pyenv/plugins/pyenv-virtualenv/shims:/home/zolf/.pyenv/shims:/home/zolf/.pyenv/bin:/home/zolf/.rbenv/shims:/home/zolf/.rbenv/bin:/home/zolf/.nvm/versions/node/v6.9.2/bin:/usr/local/sbin:/usr/local/bin:/usr/sbin:/usr/bin:/sbin:/bin:/usr/games:/usr/local/games:/snap/bin NVM_IOJS_ORG_MIRROR => https://iojs.org/dist LC_ADDRESS => zh_CN.UTF-8 MAKELEVEL => 1 XDG_RUNTIME_DIR => /run/user/1000 LC_TELEPHONE => zh_CN.UTF-8 LANG => en_US.UTF-8 PYTHONSTARTUP => /home/zolf/.pystartup LS_COLORS => rs=0:di=01;34:ln=01;36:mh=00:pi=40;33:so=01;35:do=01;35:bd=40;33;01:cd=40;33;01:or=40;31;01:mi=00:su=37;41:sg=30;43:ca=30;41:tw=30;42:ow=34;42:st=37;44:ex=01;32:*.tar=01;31:*.tgz=01;31:*.arc=01;31:*.arj=01;31:*.taz=01;31:*.lha=01;31:*.lz4=01;31:*.lzh=01;31:*.lzma=01;31:*.tlz=01;31:*.txz=01;31:*.tzo=01;31:*.t7z=01;31:*.zip=01;31:*.z=01;31:*.Z=01;31:*.dz=01;31:*.gz=01;31:*.lrz=01;31:*.lz=01;31:*.lzo=01;31:*.xz=01;31:*.bz2=01;31:*.bz=01;31:*.tbz=01;31:*.tbz2=01;31:*.tz=01;31:*.deb=01;31:*.rpm=01;31:*.jar=01;31:*.war=01;31:*.ear=01;31:*.sar=01;31:*.rar=01;31:*.alz=01;31:*.ace=01;31:*.zoo=01;31:*.cpio=01;31:*.7z=01;31:*.rz=01;31:*.cab=01;31:*.jpg=01;35:*.jpeg=01;35:*.gif=01;35:*.bmp=01;35:*.pbm=01;35:*.pgm=01;35:*.ppm=01;35:*.tga=01;35:*.xbm=01;35:*.xpm=01;35:*.tif=01;35:*.tiff=01;35:*.png=01;35:*.svg=01;35:*.svgz=01;35:*.mng=01;35:*.pcx=01;35:*.mov=01;35:*.mpg=01;35:*.mpeg=01;35:*.m2v=01;35:*.mkv=01;35:*.webm=01;35:*.ogm=01;35:*.mp4=01;35:*.m4v=01;35:*.mp4v=01;35:*.vob=01;35:*.qt=01;35:*.nuv=01;35:*.wmv=01;35:*.asf=01;35:*.rm=01;35:*.rmvb=01;35:*.flc=01;35:*.avi=01;35:*.fli=01;35:*.flv=01;35:*.gl=01;35:*.dl=01;35:*.xcf=01;35:*.xwd=01;35:*.yuv=01;35:*.cgm=01;35:*.emf=01;35:*.ogv=01;35:*.ogx=01;35:*.aac=00;36:*.au=00;36:*.flac=00;36:*.m4a=00;36:*.mid=00;36:*.midi=00;36:*.mka=00;36:*.mp3=00;36:*.mpc=00;36:*.ogg=00;36:*.ra=00;36:*.wav=00;36:*.oga=00;36:*.opus=00;36:*.spx=00;36:*.xspf=00;36: SSH_AUTH_SOCK => deleted TEST_PHPDBG_EXECUTABLE => /home/zolf/src/php-7.1.4/sapi/phpdbg/phpdbg SHELL => /bin/bash LC_NAME => zh_CN.UTF-8 MAKE_TERMOUT => /dev/pts/11 LESSCLOSE => /usr/bin/lesspipe %s %s LC_MEASUREMENT => zh_CN.UTF-8 LC_IDENTIFICATION => zh_CN.UTF-8 PWD => /home/zolf/src/php-7.1.4 PYENV_ROOT => /home/zolf/.pyenv SSH_CONNECTION => deleted LC_NUMERIC => zh_CN.UTF-8 CC => cc LC_PAPER => zh_CN.UTF-8 MFLAGS => -j --jobserver-fds=3,4 MANPATH => /usr/local/pgsql/share/man:/home/zolf/.nvm/versions/node/v6.9.2/share/man:/usr/local/man:/usr/local/share/man:/usr/share/man PHP Variables Variable => Value $_SERVER['PYENV_VIRTUALENV_INIT'] => 1 $_SERVER['LESSOPEN'] => | /usr/bin/lesspipe %s $_SERVER['MAIL'] => /var/mail/zolf $_SERVER['SSH_CLIENT'] => deleted $_SERVER['USER'] => zolf $_SERVER['LC_TIME'] => zh_CN.UTF-8 $_SERVER['SHLVL'] => 2 $_SERVER['TEST_PHP_SRCDIR'] => /home/zolf/src/php-7.1.4 $_SERVER['HOME'] => /home/zolf $_SERVER['SSH_TTY'] => deleted $_SERVER['NVM_NODEJS_ORG_MIRROR'] => https://nodejs.org/dist $_SERVER['NVM_BIN'] => /home/zolf/.nvm/versions/node/v6.9.2/bin $_SERVER['PYENV_SHELL'] => bash $_SERVER['LC_MONETARY'] => zh_CN.UTF-8 $_SERVER['MAKEFLAGS'] => -j --jobserver-fds=3,4 $_SERVER['NVM_PATH'] => /home/zolf/.nvm/versions/node/v6.9.2/lib/node $_SERVER['NVM_DIR'] => /home/zolf/.nvm $_SERVER['MAKE_TERMERR'] => /dev/pts/11 $_SERVER['QT_QPA_PLATFORMTHEME'] => appmenu-qt5 $_SERVER['LOGNAME'] => zolf $_SERVER['TEST_PHP_EXECUTABLE'] => /home/zolf/src/php-7.1.4/sapi/cli/php $_SERVER['_'] => /home/zolf/src/php-7.1.4/sapi/cli/php $_SERVER['XDG_SESSION_ID'] => 101 $_SERVER['TERM'] => xterm-256color $_SERVER['RBENV_SHELL'] => bash $_SERVER['PATH'] => /usr/local/pgsql/bin:/home/zolf/.pyenv/plugins/pyenv-virtualenv/shims:/home/zolf/.pyenv/shims:/home/zolf/.pyenv/bin:/home/zolf/.rbenv/shims:/home/zolf/.rbenv/bin:/home/zolf/.nvm/versions/node/v6.9.2/bin:/usr/local/sbin:/usr/local/bin:/usr/sbin:/usr/bin:/sbin:/bin:/usr/games:/usr/local/games:/snap/bin $_SERVER['NVM_IOJS_ORG_MIRROR'] => https://iojs.org/dist $_SERVER['LC_ADDRESS'] => zh_CN.UTF-8 $_SERVER['MAKELEVEL'] => 1 $_SERVER['XDG_RUNTIME_DIR'] => /run/user/1000 $_SERVER['LC_TELEPHONE'] => zh_CN.UTF-8 $_SERVER['LANG'] => en_US.UTF-8 $_SERVER['PYTHONSTARTUP'] => /home/zolf/.pystartup $_SERVER['LS_COLORS'] => rs=0:di=01;34:ln=01;36:mh=00:pi=40;33:so=01;35:do=01;35:bd=40;33;01:cd=40;33;01:or=40;31;01:mi=00:su=37;41:sg=30;43:ca=30;41:tw=30;42:ow=34;42:st=37;44:ex=01;32:*.tar=01;31:*.tgz=01;31:*.arc=01;31:*.arj=01;31:*.taz=01;31:*.lha=01;31:*.lz4=01;31:*.lzh=01;31:*.lzma=01;31:*.tlz=01;31:*.txz=01;31:*.tzo=01;31:*.t7z=01;31:*.zip=01;31:*.z=01;31:*.Z=01;31:*.dz=01;31:*.gz=01;31:*.lrz=01;31:*.lz=01;31:*.lzo=01;31:*.xz=01;31:*.bz2=01;31:*.bz=01;31:*.tbz=01;31:*.tbz2=01;31:*.tz=01;31:*.deb=01;31:*.rpm=01;31:*.jar=01;31:*.war=01;31:*.ear=01;31:*.sar=01;31:*.rar=01;31:*.alz=01;31:*.ace=01;31:*.zoo=01;31:*.cpio=01;31:*.7z=01;31:*.rz=01;31:*.cab=01;31:*.jpg=01;35:*.jpeg=01;35:*.gif=01;35:*.bmp=01;35:*.pbm=01;35:*.pgm=01;35:*.ppm=01;35:*.tga=01;35:*.xbm=01;35:*.xpm=01;35:*.tif=01;35:*.tiff=01;35:*.png=01;35:*.svg=01;35:*.svgz=01;35:*.mng=01;35:*.pcx=01;35:*.mov=01;35:*.mpg=01;35:*.mpeg=01;35:*.m2v=01;35:*.mkv=01;35:*.webm=01;35:*.ogm=01;35:*.mp4=01;35:*.m4v=01;35:*.mp4v=01;35:*.vob=01;35:*.qt=01;35:*.nuv=01;35:*.wmv=01;35:*.asf=01;35:*.rm=01;35:*.rmvb=01;35:*.flc=01;35:*.avi=01;35:*.fli=01;35:*.flv=01;35:*.gl=01;35:*.dl=01;35:*.xcf=01;35:*.xwd=01;35:*.yuv=01;35:*.cgm=01;35:*.emf=01;35:*.ogv=01;35:*.ogx=01;35:*.aac=00;36:*.au=00;36:*.flac=00;36:*.m4a=00;36:*.mid=00;36:*.midi=00;36:*.mka=00;36:*.mp3=00;36:*.mpc=00;36:*.ogg=00;36:*.ra=00;36:*.wav=00;36:*.oga=00;36:*.opus=00;36:*.spx=00;36:*.xspf=00;36: $_SERVER['SSH_AUTH_SOCK'] => deleted $_SERVER['TEST_PHPDBG_EXECUTABLE'] => /home/zolf/src/php-7.1.4/sapi/phpdbg/phpdbg $_SERVER['SHELL'] => /bin/bash $_SERVER['LC_NAME'] => zh_CN.UTF-8 $_SERVER['MAKE_TERMOUT'] => /dev/pts/11 $_SERVER['LESSCLOSE'] => /usr/bin/lesspipe %s %s $_SERVER['LC_MEASUREMENT'] => zh_CN.UTF-8 $_SERVER['LC_IDENTIFICATION'] => zh_CN.UTF-8 $_SERVER['PWD'] => /home/zolf/src/php-7.1.4 $_SERVER['PYENV_ROOT'] => /home/zolf/.pyenv $_SERVER['SSH_CONNECTION'] => deleted $_SERVER['LC_NUMERIC'] => zh_CN.UTF-8 $_SERVER['CC'] => cc $_SERVER['LC_PAPER'] => zh_CN.UTF-8 $_SERVER['MFLAGS'] => -j --jobserver-fds=3,4 $_SERVER['MANPATH'] => /usr/local/pgsql/share/man:/home/zolf/.nvm/versions/node/v6.9.2/share/man:/usr/local/man:/usr/local/share/man:/usr/share/man $_SERVER['PHP_SELF'] => $_SERVER['SCRIPT_NAME'] => $_SERVER['SCRIPT_FILENAME'] => $_SERVER['PATH_TRANSLATED'] => $_SERVER['DOCUMENT_ROOT'] => $_SERVER['REQUEST_TIME_FLOAT'] => 1492486018.3167 $_SERVER['REQUEST_TIME'] => 1492486018 $_SERVER['argv'] => Array ( ) $_SERVER['argc'] => 0 $_ENV['PYENV_VIRTUALENV_INIT'] => 1 $_ENV['LESSOPEN'] => | /usr/bin/lesspipe %s $_ENV['MAIL'] => /var/mail/zolf $_ENV['SSH_CLIENT'] => deleted $_ENV['USER'] => zolf $_ENV['LC_TIME'] => zh_CN.UTF-8 $_ENV['SHLVL'] => 2 $_ENV['TEST_PHP_SRCDIR'] => /home/zolf/src/php-7.1.4 $_ENV['HOME'] => /home/zolf $_ENV['SSH_TTY'] => deleted $_ENV['NVM_NODEJS_ORG_MIRROR'] => https://nodejs.org/dist $_ENV['NVM_BIN'] => /home/zolf/.nvm/versions/node/v6.9.2/bin $_ENV['PYENV_SHELL'] => bash $_ENV['LC_MONETARY'] => zh_CN.UTF-8 $_ENV['MAKEFLAGS'] => -j --jobserver-fds=3,4 $_ENV['NVM_PATH'] => /home/zolf/.nvm/versions/node/v6.9.2/lib/node $_ENV['NVM_DIR'] => /home/zolf/.nvm $_ENV['MAKE_TERMERR'] => /dev/pts/11 $_ENV['QT_QPA_PLATFORMTHEME'] => appmenu-qt5 $_ENV['LOGNAME'] => zolf $_ENV['TEST_PHP_EXECUTABLE'] => /home/zolf/src/php-7.1.4/sapi/cli/php $_ENV['_'] => /home/zolf/src/php-7.1.4/sapi/cli/php $_ENV['XDG_SESSION_ID'] => 101 $_ENV['TERM'] => xterm-256color $_ENV['RBENV_SHELL'] => bash $_ENV['PATH'] => /usr/local/pgsql/bin:/home/zolf/.pyenv/plugins/pyenv-virtualenv/shims:/home/zolf/.pyenv/shims:/home/zolf/.pyenv/bin:/home/zolf/.rbenv/shims:/home/zolf/.rbenv/bin:/home/zolf/.nvm/versions/node/v6.9.2/bin:/usr/local/sbin:/usr/local/bin:/usr/sbin:/usr/bin:/sbin:/bin:/usr/games:/usr/local/games:/snap/bin $_ENV['NVM_IOJS_ORG_MIRROR'] => https://iojs.org/dist $_ENV['LC_ADDRESS'] => zh_CN.UTF-8 $_ENV['MAKELEVEL'] => 1 $_ENV['XDG_RUNTIME_DIR'] => /run/user/1000 $_ENV['LC_TELEPHONE'] => zh_CN.UTF-8 $_ENV['LANG'] => en_US.UTF-8 $_ENV['PYTHONSTARTUP'] => /home/zolf/.pystartup $_ENV['LS_COLORS'] => rs=0:di=01;34:ln=01;36:mh=00:pi=40;33:so=01;35:do=01;35:bd=40;33;01:cd=40;33;01:or=40;31;01:mi=00:su=37;41:sg=30;43:ca=30;41:tw=30;42:ow=34;42:st=37;44:ex=01;32:*.tar=01;31:*.tgz=01;31:*.arc=01;31:*.arj=01;31:*.taz=01;31:*.lha=01;31:*.lz4=01;31:*.lzh=01;31:*.lzma=01;31:*.tlz=01;31:*.txz=01;31:*.tzo=01;31:*.t7z=01;31:*.zip=01;31:*.z=01;31:*.Z=01;31:*.dz=01;31:*.gz=01;31:*.lrz=01;31:*.lz=01;31:*.lzo=01;31:*.xz=01;31:*.bz2=01;31:*.bz=01;31:*.tbz=01;31:*.tbz2=01;31:*.tz=01;31:*.deb=01;31:*.rpm=01;31:*.jar=01;31:*.war=01;31:*.ear=01;31:*.sar=01;31:*.rar=01;31:*.alz=01;31:*.ace=01;31:*.zoo=01;31:*.cpio=01;31:*.7z=01;31:*.rz=01;31:*.cab=01;31:*.jpg=01;35:*.jpeg=01;35:*.gif=01;35:*.bmp=01;35:*.pbm=01;35:*.pgm=01;35:*.ppm=01;35:*.tga=01;35:*.xbm=01;35:*.xpm=01;35:*.tif=01;35:*.tiff=01;35:*.png=01;35:*.svg=01;35:*.svgz=01;35:*.mng=01;35:*.pcx=01;35:*.mov=01;35:*.mpg=01;35:*.mpeg=01;35:*.m2v=01;35:*.mkv=01;35:*.webm=01;35:*.ogm=01;35:*.mp4=01;35:*.m4v=01;35:*.mp4v=01;35:*.vob=01;35:*.qt=01;35:*.nuv=01;35:*.wmv=01;35:*.asf=01;35:*.rm=01;35:*.rmvb=01;35:*.flc=01;35:*.avi=01;35:*.fli=01;35:*.flv=01;35:*.gl=01;35:*.dl=01;35:*.xcf=01;35:*.xwd=01;35:*.yuv=01;35:*.cgm=01;35:*.emf=01;35:*.ogv=01;35:*.ogx=01;35:*.aac=00;36:*.au=00;36:*.flac=00;36:*.m4a=00;36:*.mid=00;36:*.midi=00;36:*.mka=00;36:*.mp3=00;36:*.mpc=00;36:*.ogg=00;36:*.ra=00;36:*.wav=00;36:*.oga=00;36:*.opus=00;36:*.spx=00;36:*.xspf=00;36: $_ENV['SSH_AUTH_SOCK'] => deleted $_ENV['TEST_PHPDBG_EXECUTABLE'] => /home/zolf/src/php-7.1.4/sapi/phpdbg/phpdbg $_ENV['SHELL'] => /bin/bash $_ENV['LC_NAME'] => zh_CN.UTF-8 $_ENV['MAKE_TERMOUT'] => /dev/pts/11 $_ENV['LESSCLOSE'] => /usr/bin/lesspipe %s %s $_ENV['LC_MEASUREMENT'] => zh_CN.UTF-8 $_ENV['LC_IDENTIFICATION'] => zh_CN.UTF-8 $_ENV['PWD'] => /home/zolf/src/php-7.1.4 $_ENV['PYENV_ROOT'] => /home/zolf/.pyenv $_ENV['SSH_CONNECTION'] => deleted $_ENV['LC_NUMERIC'] => zh_CN.UTF-8 $_ENV['CC'] => cc $_ENV['LC_PAPER'] => zh_CN.UTF-8 $_ENV['MFLAGS'] => -j --jobserver-fds=3,4 $_ENV['MANPATH'] => /usr/local/pgsql/share/man:/home/zolf/.nvm/versions/node/v6.9.2/share/man:/usr/local/man:/usr/local/share/man:/usr/share/man PHP License This program is free software; you can redistribute it and/or modify it under the terms of the PHP License as published by the PHP Group and included in the distribution in the file: LICENSE This program is distributed in the hope that it will be useful, but WITHOUT ANY WARRANTY; without even the implied warranty of MERCHANTABILITY or FITNESS FOR A PARTICULAR PURPOSE. If you did not receive a copy of the PHP license, or have any questions about PHP licensing, please contact license@php.net.
===================================================================== EXPECTED FAILED TEST SUMMARY --------------------------------------------------------------------- Test open_basedir configuration [tests/security/open_basedir_linkinfo.phpt] XFAIL REASON: BUG: open_basedir cannot delete symlink to prohibited file. See also bugs 48111 and 52176. Inconsistencies when accessing protected members [Zend/tests/access_modifiers_008.phpt] XFAIL REASON: Discussion: http://marc.info/?l=php-internals&m=120221184420957&w=2 Inconsistencies when accessing protected members - 2 [Zend/tests/access_modifiers_009.phpt] XFAIL REASON: Discussion: http://marc.info/?l=php-internals&m=120221184420957&w=2 Bug #48770 (call_user_func_array() fails to call parent from inheriting class) [Zend/tests/bug48770.phpt] XFAIL REASON: See Bug #48770 Bug #48770 (call_user_func_array() fails to call parent from inheriting class) [Zend/tests/bug48770_2.phpt] XFAIL REASON: See Bug #48770 Bug #48770 (call_user_func_array() fails to call parent from inheriting class) [Zend/tests/bug48770_3.phpt] XFAIL REASON: See Bug #48770 Initial value of static var in method depends on the include time of the class definition [Zend/tests/method_static_var.phpt] XFAIL REASON: Maybe not a bug DateTime::add() -- fall type2 type3 [ext/date/tests/DateTime_add-fall-type2-type3.phpt] XFAIL REASON: Various bugs exist DateTime::add() -- fall type3 type2 [ext/date/tests/DateTime_add-fall-type3-type2.phpt] XFAIL REASON: Various bugs exist DateTime::add() -- fall type3 type3 [ext/date/tests/DateTime_add-fall-type3-type3.phpt] XFAIL REASON: Various bugs exist DateTime::add() -- spring type2 type3 [ext/date/tests/DateTime_add-spring-type2-type3.phpt] XFAIL REASON: Various bugs exist DateTime::add() -- spring type3 type2 [ext/date/tests/DateTime_add-spring-type3-type2.phpt] XFAIL REASON: Various bugs exist DateTime::add() -- spring type3 type3 [ext/date/tests/DateTime_add-spring-type3-type3.phpt] XFAIL REASON: Various bugs exist DateTime::diff() -- fall type2 type3 [ext/date/tests/DateTime_diff-fall-type2-type3.phpt] XFAIL REASON: Various bugs exist DateTime::diff() -- fall type3 type2 [ext/date/tests/DateTime_diff-fall-type3-type2.phpt] XFAIL REASON: Various bugs exist DateTime::diff() -- fall type3 type3 [ext/date/tests/DateTime_diff-fall-type3-type3.phpt] XFAIL REASON: Various bugs exist DateTime::diff() -- spring type2 type3 [ext/date/tests/DateTime_diff-spring-type2-type3.phpt] XFAIL REASON: Various bugs exist DateTime::diff() -- spring type3 type2 [ext/date/tests/DateTime_diff-spring-type3-type2.phpt] XFAIL REASON: Various bugs exist DateTime::diff() -- spring type3 type3 [ext/date/tests/DateTime_diff-spring-type3-type3.phpt] XFAIL REASON: Various bugs exist DateTime::sub() -- fall type2 type3 [ext/date/tests/DateTime_sub-fall-type2-type3.phpt] XFAIL REASON: Various bugs exist DateTime::sub() -- fall type3 type2 [ext/date/tests/DateTime_sub-fall-type3-type2.phpt] XFAIL REASON: Various bugs exist DateTime::sub() -- fall type3 type3 [ext/date/tests/DateTime_sub-fall-type3-type3.phpt] XFAIL REASON: Various bugs exist DateTime::sub() -- spring type2 type3 [ext/date/tests/DateTime_sub-spring-type2-type3.phpt] XFAIL REASON: Various bugs exist DateTime::sub() -- spring type3 type2 [ext/date/tests/DateTime_sub-spring-type3-type2.phpt] XFAIL REASON: Various bugs exist DateTime::sub() -- spring type3 type3 [ext/date/tests/DateTime_sub-spring-type3-type3.phpt] XFAIL REASON: Various bugs exist Bug #55407 (Impossible to prototype DateTime::createFromFormat) [ext/date/tests/bug55407.phpt] XFAIL REASON: Bug #55407 RFC: DateTime and Daylight Saving Time Transitions (zone type 3, bd2) [ext/date/tests/rfc-datetime_and_daylight_saving_time-type3-bd2.phpt] XFAIL REASON: Still not quite right RFC: DateTime and Daylight Saving Time Transitions (zone type 3, fs) [ext/date/tests/rfc-datetime_and_daylight_saving_time-type3-fs.phpt] XFAIL REASON: Still not quite right Bug #42718 (unsafe_raw filter not applied when configured as default filter) [ext/filter/tests/bug42718.phpt] XFAIL REASON: FILTER_UNSAFE_RAW not applied when configured as default filter, even with flags Bug #67296 (filter_input doesn't validate variables) [ext/filter/tests/bug49184.phpt] XFAIL REASON: See Bug #49184 Bug #67167: filter_var(null,FILTER_VALIDATE_BOOLEAN,FILTER_NULL_ON_FAILURE) returns null [ext/filter/tests/bug67167.02.phpt] XFAIL REASON: Requires php_zval_filter to not use convert_to_string for all filters. Phar: bug #69958: Segfault in Phar::convertToData on invalid file [ext/phar/tests/bug69958.phpt] XFAIL REASON: Still has memory leaks, see https://bugs.php.net/bug.php?id=70005 updateTimestamp never called when session data is empty [ext/session/tests/bug71162.phpt] XFAIL REASON: Current session module is designed to write empty session always. In addition, current session module only supports SessionHandlerInterface only from PHP 7.0. Bug #70219 Use after free vulnerability in session deserializer [ext/standard/tests/serialize/bug70219.phpt] XFAIL REASON: Unfinished merge, needs fix. Bug #70470 (Built-in server truncates headers spanning over TCP packets) [sapi/cli/tests/bug70470.phpt] XFAIL REASON: bug is not fixed yet ===================================================================== ===================================================================== FAILED TEST SUMMARY --------------------------------------------------------------------- Bug #64267 (CURLOPT_INFILE doesn't allow reset) [ext/curl/tests/bug64267.phpt] Bug #71523 (Copied handle with new option CURLOPT_HTTPHEADER crashes while curl_multi_exec) [ext/curl/tests/bug71523.phpt] Bug #70417 (PharData::compress() doesn't close temp file) [ext/phar/tests/tar/bug70417.phpt] int stream_socket_sendto ( resource $socket , string $data [, int $flags = 0 [, string $address ]] ); [ext/standard/tests/streams/stream_socket_sendto.phpt] ===================================================================== ===================================================================== WARNED TEST SUMMARY --------------------------------------------------------------------- FPM: Test status page [sapi/fpm/tests/010.phpt] (warn: XFAIL section but test passes) FPM: Test various messages on start, from master and childs [sapi/fpm/tests/015.phpt] (warn: XFAIL section but test passes) ===================================================================== ===================================================================== TEST RESULT SUMMARY --------------------------------------------------------------------- Exts skipped : 24 Exts tested : 50 --------------------------------------------------------------------- Number of tests : 15411 12323 Tests skipped : 3088 ( 20.0%) -------- Tests warned : 2 ( 0.0%) ( 0.0%) Tests failed : 4 ( 0.0%) ( 0.0%) Expected fail : 35 ( 0.2%) ( 0.3%) Tests passed : 12282 ( 79.7%) ( 99.7%) --------------------------------------------------------------------- Time taken : 2058 seconds ===================================================================== ===================================================================== EXPECTED FAILED TEST SUMMARY --------------------------------------------------------------------- Test open_basedir configuration [tests/security/open_basedir_linkinfo.phpt] XFAIL REASON: BUG: open_basedir cannot delete symlink to prohibited file. See also bugs 48111 and 52176. Inconsistencies when accessing protected members [Zend/tests/access_modifiers_008.phpt] XFAIL REASON: Discussion: http://marc.info/?l=php-internals&m=120221184420957&w=2 Inconsistencies when accessing protected members - 2 [Zend/tests/access_modifiers_009.phpt] XFAIL REASON: Discussion: http://marc.info/?l=php-internals&m=120221184420957&w=2 Bug #48770 (call_user_func_array() fails to call parent from inheriting class) [Zend/tests/bug48770.phpt] XFAIL REASON: See Bug #48770 Bug #48770 (call_user_func_array() fails to call parent from inheriting class) [Zend/tests/bug48770_2.phpt] XFAIL REASON: See Bug #48770 Bug #48770 (call_user_func_array() fails to call parent from inheriting class) [Zend/tests/bug48770_3.phpt] XFAIL REASON: See Bug #48770 Initial value of static var in method depends on the include time of the class definition [Zend/tests/method_static_var.phpt] XFAIL REASON: Maybe not a bug DateTime::add() -- fall type2 type3 [ext/date/tests/DateTime_add-fall-type2-type3.phpt] XFAIL REASON: Various bugs exist DateTime::add() -- fall type3 type2 [ext/date/tests/DateTime_add-fall-type3-type2.phpt] XFAIL REASON: Various bugs exist DateTime::add() -- fall type3 type3 [ext/date/tests/DateTime_add-fall-type3-type3.phpt] XFAIL REASON: Various bugs exist DateTime::add() -- spring type2 type3 [ext/date/tests/DateTime_add-spring-type2-type3.phpt] XFAIL REASON: Various bugs exist DateTime::add() -- spring type3 type2 [ext/date/tests/DateTime_add-spring-type3-type2.phpt] XFAIL REASON: Various bugs exist DateTime::add() -- spring type3 type3 [ext/date/tests/DateTime_add-spring-type3-type3.phpt] XFAIL REASON: Various bugs exist DateTime::diff() -- fall type2 type3 [ext/date/tests/DateTime_diff-fall-type2-type3.phpt] XFAIL REASON: Various bugs exist DateTime::diff() -- fall type3 type2 [ext/date/tests/DateTime_diff-fall-type3-type2.phpt] XFAIL REASON: Various bugs exist DateTime::diff() -- fall type3 type3 [ext/date/tests/DateTime_diff-fall-type3-type3.phpt] XFAIL REASON: Various bugs exist DateTime::diff() -- spring type2 type3 [ext/date/tests/DateTime_diff-spring-type2-type3.phpt] XFAIL REASON: Various bugs exist DateTime::diff() -- spring type3 type2 [ext/date/tests/DateTime_diff-spring-type3-type2.phpt] XFAIL REASON: Various bugs exist DateTime::diff() -- spring type3 type3 [ext/date/tests/DateTime_diff-spring-type3-type3.phpt] XFAIL REASON: Various bugs exist DateTime::sub() -- fall type2 type3 [ext/date/tests/DateTime_sub-fall-type2-type3.phpt] XFAIL REASON: Various bugs exist DateTime::sub() -- fall type3 type2 [ext/date/tests/DateTime_sub-fall-type3-type2.phpt] XFAIL REASON: Various bugs exist DateTime::sub() -- fall type3 type3 [ext/date/tests/DateTime_sub-fall-type3-type3.phpt] XFAIL REASON: Various bugs exist DateTime::sub() -- spring type2 type3 [ext/date/tests/DateTime_sub-spring-type2-type3.phpt] XFAIL REASON: Various bugs exist DateTime::sub() -- spring type3 type2 [ext/date/tests/DateTime_sub-spring-type3-type2.phpt] XFAIL REASON: Various bugs exist DateTime::sub() -- spring type3 type3 [ext/date/tests/DateTime_sub-spring-type3-type3.phpt] XFAIL REASON: Various bugs exist Bug #55407 (Impossible to prototype DateTime::createFromFormat) [ext/date/tests/bug55407.phpt] XFAIL REASON: Bug #55407 RFC: DateTime and Daylight Saving Time Transitions (zone type 3, bd2) [ext/date/tests/rfc-datetime_and_daylight_saving_time-type3-bd2.phpt] XFAIL REASON: Still not quite right RFC: DateTime and Daylight Saving Time Transitions (zone type 3, fs) [ext/date/tests/rfc-datetime_and_daylight_saving_time-type3-fs.phpt] XFAIL REASON: Still not quite right Bug #42718 (unsafe_raw filter not applied when configured as default filter) [ext/filter/tests/bug42718.phpt] XFAIL REASON: FILTER_UNSAFE_RAW not applied when configured as default filter, even with flags Bug #67296 (filter_input doesn't validate variables) [ext/filter/tests/bug49184.phpt] XFAIL REASON: See Bug #49184 Bug #67167: filter_var(null,FILTER_VALIDATE_BOOLEAN,FILTER_NULL_ON_FAILURE) returns null [ext/filter/tests/bug67167.02.phpt] XFAIL REASON: Requires php_zval_filter to not use convert_to_string for all filters. Phar: bug #69958: Segfault in Phar::convertToData on invalid file [ext/phar/tests/bug69958.phpt] XFAIL REASON: Still has memory leaks, see https://bugs.php.net/bug.php?id=70005 updateTimestamp never called when session data is empty [ext/session/tests/bug71162.phpt] XFAIL REASON: Current session module is designed to write empty session always. In addition, current session module only supports SessionHandlerInterface only from PHP 7.0. Bug #70219 Use after free vulnerability in session deserializer [ext/standard/tests/serialize/bug70219.phpt] XFAIL REASON: Unfinished merge, needs fix. Bug #70470 (Built-in server truncates headers spanning over TCP packets) [sapi/cli/tests/bug70470.phpt] XFAIL REASON: bug is not fixed yet ===================================================================== ===================================================================== FAILED TEST SUMMARY --------------------------------------------------------------------- Bug #64267 (CURLOPT_INFILE doesn't allow reset) [ext/curl/tests/bug64267.phpt] Bug #71523 (Copied handle with new option CURLOPT_HTTPHEADER crashes while curl_multi_exec) [ext/curl/tests/bug71523.phpt] Bug #70417 (PharData::compress() doesn't close temp file) [ext/phar/tests/tar/bug70417.phpt] int stream_socket_sendto ( resource $socket , string $data [, int $flags = 0 [, string $address ]] ); [ext/standard/tests/streams/stream_socket_sendto.phpt] ===================================================================== ===================================================================== WARNED TEST SUMMARY --------------------------------------------------------------------- FPM: Test status page [sapi/fpm/tests/010.phpt] (warn: XFAIL section but test passes) FPM: Test various messages on start, from master and childs [sapi/fpm/tests/015.phpt] (warn: XFAIL section but test passes) ===================================================================== ================================================================================ /home/zolf/src/php-7.1.4/ext/curl/tests/bug64267.phpt ================================================================================ TEST bool(true) bool(true) int(0) ===DONE=== ================================================================================ 004+ int(0) 004- int(30%d) ================================================================================ ================================================================================ /home/zolf/src/php-7.1.4/ext/curl/tests/bug71523.phpt ================================================================================ ** ERROR: process timed out ** ================================================================================ 001+ ** ERROR: process timed out ** 001- okey ================================================================================ ================================================================================ /home/zolf/src/php-7.1.4/ext/phar/tests/tar/bug70417.phpt ================================================================================ lsof: WARNING: can't stat() fuse.gvfsd-fuse file system /run/user/108/gvfs Output information may be incomplete. lsof: WARNING: can't stat() fuse.gvfsd-fuse file system /run/user/108/gvfs Output information may be incomplete. bool(true) ================================================================================ 001+ lsof: WARNING: can't stat() fuse.gvfsd-fuse file system /run/user/108/gvfs 002+ Output information may be incomplete. 003+ lsof: WARNING: can't stat() fuse.gvfsd-fuse file system /run/user/108/gvfs 004+ Output information may be incomplete. ================================================================================ ================================================================================ /home/zolf/src/php-7.1.4/ext/standard/tests/streams/stream_socket_sendto.phpt ================================================================================ Notice: fwrite(): send of 23 bytes failed with errno=32 Broken pipe in /home/zolf/src/php-7.1.4/ext/standard/tests/streams/stream_socket_sendto.php on line 9 Warning: stream_socket_sendto() expects at least 2 parameters, 0 given in /home/zolf/src/php-7.1.4/ext/standard/tests/streams/stream_socket_sendto.php on line 10 bool(false) Warning: stream_socket_sendto() expects at least 2 parameters, 1 given in /home/zolf/src/php-7.1.4/ext/standard/tests/streams/stream_socket_sendto.php on line 11 bool(false) Warning: stream_socket_sendto(): Broken pipe in /home/zolf/src/php-7.1.4/ext/standard/tests/streams/stream_socket_sendto.php on line 12 int(-1) Warning: stream_socket_sendto(): Broken pipe in /home/zolf/src/php-7.1.4/ext/standard/tests/streams/stream_socket_sendto.php on line 13 int(-1) Warning: stream_socket_sendto(): php_network_getaddresses: getaddrinfo failed: No address associated with hostname in /home/zolf/src/php-7.1.4/ext/standard/tests/streams/stream_socket_sendto.php on line 14 Warning: stream_socket_sendto(): Failed to resolve `tcp': php_network_getaddresses: getaddrinfo failed: No address associated with hostname in /home/zolf/src/php-7.1.4/ext/standard/tests/streams/stream_socket_sendto.php on line 14 Warning: stream_socket_sendto(): Failed to parse `tcp://127.0.0.1:31854' into a valid network address in /home/zolf/src/php-7.1.4/ext/standard/tests/streams/stream_socket_sendto.php on line 14 bool(false) Warning: stream_socket_sendto(): php_network_getaddresses: getaddrinfo failed: No address associated with hostname in /home/zolf/src/php-7.1.4/ext/standard/tests/streams/stream_socket_sendto.php on line 15 Warning: stream_socket_sendto(): Failed to resolve `http': php_network_getaddresses: getaddrinfo failed: No address associated with hostname in /home/zolf/src/php-7.1.4/ext/standard/tests/streams/stream_socket_sendto.php on line 15 Warning: stream_socket_sendto(): Failed to parse `http://php.net' into a valid network address in /home/zolf/src/php-7.1.4/ext/standard/tests/streams/stream_socket_sendto.php on line 15 bool(false) ================================================================================ 017+ Warning: stream_socket_sendto(): php_network_getaddresses: getaddrinfo failed: No address associated with hostname in /home/zolf/src/php-7.1.4/ext/standard/tests/streams/stream_socket_sendto.php on line 14 017- Warning: stream_socket_sendto(): php_network_getaddresses: getaddrinfo failed: Name or service not known in %s on line %i 019+ Warning: stream_socket_sendto(): Failed to resolve `tcp': php_network_getaddresses: getaddrinfo failed: No address associated with hostname in /home/zolf/src/php-7.1.4/ext/standard/tests/streams/stream_socket_sendto.php on line 14 019- Warning: stream_socket_sendto(): Failed to resolve %s: php_network_getaddresses: getaddrinfo failed: Name or service not known in %s on line %i 024+ Warning: stream_socket_sendto(): php_network_getaddresses: getaddrinfo failed: No address associated with hostname in /home/zolf/src/php-7.1.4/ext/standard/tests/streams/stream_socket_sendto.php on line 15 024- Warning: stream_socket_sendto(): php_network_getaddresses: getaddrinfo failed: Name or service not known in %s on line %i 026+ Warning: stream_socket_sendto(): Failed to resolve `http': php_network_getaddresses: getaddrinfo failed: No address associated with hostname in /home/zolf/src/php-7.1.4/ext/standard/tests/streams/stream_socket_sendto.php on line 15 026- Warning: stream_socket_sendto(): Failed to resolve %s: php_network_getaddresses: getaddrinfo failed: Name or service not known in %s on line %i ================================================================================ ================================================================================ BUILD ENVIRONMENT ================================================================================ OS: Linux - Linux minipc 4.4.0-72-generic #93-Ubuntu SMP Fri Mar 31 14:07:41 UTC 2017 x86_64 Autoconf: Bundled Libtool: ltmain.sh (GNU libtool) 1.5.26 (1.1220.2.492 2008/01/30 06:40:56) Copyright (C) 2008 Free Software Foundation, Inc. This is free software; see the source for copying conditions. There is NO warranty; not even for MERCHANTABILITY or FITNESS FOR A PARTICULAR PURPOSE. System Libtool: N/A Compiler: Using built-in specs. COLLECT_GCC=cc COLLECT_LTO_WRAPPER=/usr/lib/gcc/x86_64-linux-gnu/5/lto-wrapper Target: x86_64-linux-gnu Configured with: ../src/configure -v --with-pkgversion='Ubuntu 5.4.0-6ubuntu1~16.04.4' --with-bugurl=file:///usr/share/doc/gcc-5/README.Bugs --enable-languages=c,ada,c++,java,go,d,fortran,objc,obj-c++ --prefix=/usr --program-suffix=-5 --enable-shared --enable-linker-build-id --libexecdir=/usr/lib --without-included-gettext --enable-threads=posix --libdir=/usr/lib --enable-nls --with-sysroot=/ --enable-clocale=gnu --enable-libstdcxx-debug --enable-libstdcxx-time=yes --with-default-libstdcxx-abi=new --enable-gnu-unique-object --disable-vtable-verify --enable-libmpx --enable-plugin --with-system-zlib --disable-browser-plugin --enable-java-awt=gtk --enable-gtk-cairo --with-java-home=/usr/lib/jvm/java-1.5.0-gcj-5-amd64/jre --enable-java-home --with-jvm-root-dir=/usr/lib/jvm/java-1.5.0-gcj-5-amd64 --with-jvm-jar-dir=/usr/lib/jvm-exports/java-1.5.0-gcj-5-amd64 --with-arch-directory=amd64 --with-ecj-jar=/usr/share/java/eclipse-ecj.jar --enable-objc-gc --enable-multiarch --disable-werror --with-arch-32=i686 --with-abi=m64 --with-multilib-list=m32,m64,mx32 --enable-multilib --with-tune=generic --enable-checking=release --build=x86_64-linux-gnu --host=x86_64-linux-gnu --target=x86_64-linux-gnu Thread model: posix gcc version 5.4.0 20160609 (Ubuntu 5.4.0-6ubuntu1~16.04.4) Bison: Libraries: linux-vdso.so.1 => (0x00007ffc9a3e5000) libz.so.1 => /lib/x86_64-linux-gnu/libz.so.1 (0x00007fd625e57000) libexslt.so.0 => /usr/lib/x86_64-linux-gnu/libexslt.so.0 (0x00007fd625c42000) libresolv.so.2 => /lib/x86_64-linux-gnu/libresolv.so.2 (0x00007fd625a26000) libaspell.so.15 => /usr/lib/x86_64-linux-gnu/libaspell.so.15 (0x00007fd62577c000) libpq.so.5 => /usr/local/pgsql/lib/libpq.so.5 (0x00007fd62554e000) libmcrypt.so.4 => /usr/lib/libmcrypt.so.4 (0x00007fd625319000) libstdc++.so.6 => /usr/lib/x86_64-linux-gnu/libstdc++.so.6 (0x00007fd624f97000) libpng12.so.0 => /usr/lib/x86_64-linux-gnu/libpng12.so.0 (0x00007fd624d72000) libjpeg.so.8 => /usr/lib/x86_64-linux-gnu/libjpeg.so.8 (0x00007fd624b18000) libwebp.so.5 => /usr/lib/x86_64-linux-gnu/libwebp.so.5 (0x00007fd6248bc000) libbz2.so.1.0 => /lib/x86_64-linux-gnu/libbz2.so.1.0 (0x00007fd6246ac000) libm.so.6 => /lib/x86_64-linux-gnu/libm.so.6 (0x00007fd6243a2000) libdl.so.2 => /lib/x86_64-linux-gnu/libdl.so.2 (0x00007fd62419e000) libxml2.so.2 => /usr/lib/x86_64-linux-gnu/libxml2.so.2 (0x00007fd623de3000) libssl.so.1.0.0 => /lib/x86_64-linux-gnu/libssl.so.1.0.0 (0x00007fd623b79000) libcrypto.so.1.0.0 => /lib/x86_64-linux-gnu/libcrypto.so.1.0.0 (0x00007fd623735000) libcurl.so.4 => /usr/lib/x86_64-linux-gnu/libcurl.so.4 (0x00007fd6234c6000) libfreetype.so.6 => /usr/lib/x86_64-linux-gnu/libfreetype.so.6 (0x00007fd62321b000) libicui18n.so.55 => /usr/lib/x86_64-linux-gnu/libicui18n.so.55 (0x00007fd622db9000) libicuuc.so.55 => /usr/lib/x86_64-linux-gnu/libicuuc.so.55 (0x00007fd622a25000) libicuio.so.55 => /usr/lib/x86_64-linux-gnu/libicuio.so.55 (0x00007fd622816000) libxslt.so.1 => /usr/lib/x86_64-linux-gnu/libxslt.so.1 (0x00007fd6225d9000) libgcc_s.so.1 => /lib/x86_64-linux-gnu/libgcc_s.so.1 (0x00007fd6223c3000) libc.so.6 => /lib/x86_64-linux-gnu/libc.so.6 (0x00007fd621ff9000) libgcrypt.so.20 => /lib/x86_64-linux-gnu/libgcrypt.so.20 (0x00007fd621d18000) libpthread.so.0 => /lib/x86_64-linux-gnu/libpthread.so.0 (0x00007fd621afb000) /lib64/ld-linux-x86-64.so.2 (0x00005595807d0000) liblzma.so.5 => /lib/x86_64-linux-gnu/liblzma.so.5 (0x00007fd6218d8000) libidn.so.11 => /usr/lib/x86_64-linux-gnu/libidn.so.11 (0x00007fd6216a5000) librtmp.so.1 => /usr/lib/x86_64-linux-gnu/librtmp.so.1 (0x00007fd621488000) libgssapi_krb5.so.2 => /usr/lib/x86_64-linux-gnu/libgssapi_krb5.so.2 (0x00007fd62123e000) liblber-2.4.so.2 => /usr/lib/x86_64-linux-gnu/liblber-2.4.so.2 (0x00007fd62102f000) libldap_r-2.4.so.2 => /usr/lib/x86_64-linux-gnu/libldap_r-2.4.so.2 (0x00007fd620ddd000) libicudata.so.55 => /usr/lib/x86_64-linux-gnu/libicudata.so.55 (0x00007fd61f326000) libgpg-error.so.0 => /lib/x86_64-linux-gnu/libgpg-error.so.0 (0x00007fd61f111000) libgnutls.so.30 => /usr/lib/x86_64-linux-gnu/libgnutls.so.30 (0x00007fd61ede1000) libhogweed.so.4 => /usr/lib/x86_64-linux-gnu/libhogweed.so.4 (0x00007fd61ebae000) libnettle.so.6 => /usr/lib/x86_64-linux-gnu/libnettle.so.6 (0x00007fd61e977000) libgmp.so.10 => /usr/lib/x86_64-linux-gnu/libgmp.so.10 (0x00007fd61e6f7000) libkrb5.so.3 => /usr/lib/x86_64-linux-gnu/libkrb5.so.3 (0x00007fd61e425000) libk5crypto.so.3 => /usr/lib/x86_64-linux-gnu/libk5crypto.so.3 (0x00007fd61e1f5000) libcom_err.so.2 => /lib/x86_64-linux-gnu/libcom_err.so.2 (0x00007fd61dff1000) libkrb5support.so.0 => /usr/lib/x86_64-linux-gnu/libkrb5support.so.0 (0x00007fd61dde6000) libsasl2.so.2 => /usr/lib/x86_64-linux-gnu/libsasl2.so.2 (0x00007fd61dbca000) libgssapi.so.3 => /usr/lib/x86_64-linux-gnu/libgssapi.so.3 (0x00007fd61d989000) libp11-kit.so.0 => /usr/lib/x86_64-linux-gnu/libp11-kit.so.0 (0x00007fd61d725000) libtasn1.so.6 => /usr/lib/x86_64-linux-gnu/libtasn1.so.6 (0x00007fd61d511000) libkeyutils.so.1 => /lib/x86_64-linux-gnu/libkeyutils.so.1 (0x00007fd61d30d000) libheimntlm.so.0 => /usr/lib/x86_64-linux-gnu/libheimntlm.so.0 (0x00007fd61d103000) libkrb5.so.26 => /usr/lib/x86_64-linux-gnu/libkrb5.so.26 (0x00007fd61ce79000) libasn1.so.8 => /usr/lib/x86_64-linux-gnu/libasn1.so.8 (0x00007fd61cbd7000) libhcrypto.so.4 => /usr/lib/x86_64-linux-gnu/libhcrypto.so.4 (0x00007fd61c9a3000) libroken.so.18 => /usr/lib/x86_64-linux-gnu/libroken.so.18 (0x00007fd61c78d000) libffi.so.6 => /usr/lib/x86_64-linux-gnu/libffi.so.6 (0x00007fd61c585000) libwind.so.0 => /usr/lib/x86_64-linux-gnu/libwind.so.0 (0x00007fd61c35b000) libheimbase.so.1 => /usr/lib/x86_64-linux-gnu/libheimbase.so.1 (0x00007fd61c14c000) libhx509.so.5 => /usr/lib/x86_64-linux-gnu/libhx509.so.5 (0x00007fd61bf01000) libsqlite3.so.0 => /usr/lib/x86_64-linux-gnu/libsqlite3.so.0 (0x00007fd61bc2b000) libcrypt.so.1 => /lib/x86_64-linux-gnu/libcrypt.so.1 (0x00007fd61b9f3000) ================================================================================ PHPINFO ================================================================================ phpinfo() PHP Version => 7.1.4 System => Linux minipc 4.4.0-72-generic #93-Ubuntu SMP Fri Mar 31 14:07:41 UTC 2017 x86_64 Build Date => Apr 18 2017 10:28:48 Configure Command => './configure' '--prefix=/usr/local/php7' '--with-openssl' '--with-curl' '--with-zlib' '--with-bz2' '--with-gd' '--with-jpeg-dir' '--with-png-dir' '--with-webp-dir' '--with-freetype-dir' '--with-gettext' '--with-pgsql=/usr/local/pgsql' '--with-pdo-pgsql' '--with-libdir=lib64' '--with-mcrypt' '--with-kerberos' '--with-xsl' '--with-xmlrpc' '--enable-fpm' '--with-fpm-systemd' '--enable-libxml' '--enable-xml' '--enable-zip' '--enable-exif' '--enable-intl' '--enable-mbstring' '--enable-mbregex' '--enable-bcmath' '--enable-calendar' '--with-pspell' '--enable-pcntl' '--enable-shmop' '--enable-sockets' '--enable-sysvsem' '--enable-sysvshm' '--enable-sysvmsg' '--enable-inline-optimization' Server API => Command Line Interface Virtual Directory Support => disabled Configuration File (php.ini) Path => /usr/local/php7/lib Loaded Configuration File => (none) Scan this dir for additional .ini files => (none) Additional .ini files parsed => (none) PHP API => 20160303 PHP Extension => 20160303 Zend Extension => 320160303 Zend Extension Build => API320160303,NTS PHP Extension Build => API20160303,NTS Debug Build => no Thread Safety => disabled Zend Signal Handling => enabled Zend Memory Manager => enabled Zend Multibyte Support => provided by mbstring IPv6 Support => enabled DTrace Support => disabled Registered PHP Streams => https, ftps, compress.zlib, compress.bzip2, php, file, glob, data, http, ftp, phar, zip Registered Stream Socket Transports => tcp, udp, unix, udg, ssl, tls, tlsv1.0, tlsv1.1, tlsv1.2 Registered Stream Filters => zlib.*, bzip2.*, convert.iconv.*, mcrypt.*, mdecrypt.*, string.rot13, string.toupper, string.tolower, string.strip_tags, convert.*, consumed, dechunk This program makes use of the Zend Scripting Language Engine: Zend Engine v3.1.0, Copyright (c) 1998-2017 Zend Technologies _______________________________________________________________________ Configuration bcmath BCMath support => enabled Directive => Local Value => Master Value bcmath.scale => 0 => 0 bz2 BZip2 Support => Enabled Stream Wrapper support => compress.bzip2:// Stream Filter support => bzip2.decompress, bzip2.compress BZip2 Version => 1.0.6, 6-Sept-2010 calendar Calendar support => enabled Core PHP Version => 7.1.4 Directive => Local Value => Master Value allow_url_fopen => On => On allow_url_include => Off => Off arg_separator.input => & => & arg_separator.output => & => & auto_append_file => no value => no value auto_globals_jit => On => On auto_prepend_file => no value => no value browscap => no value => no value default_charset => UTF-8 => UTF-8 default_mimetype => text/html => text/html disable_classes => no value => no value disable_functions => no value => no value display_errors => STDERR => STDERR display_startup_errors => Off => Off doc_root => no value => no value docref_ext => no value => no value docref_root => no value => no value enable_dl => On => On enable_post_data_reading => On => On error_append_string => no value => no value error_log => no value => no value error_prepend_string => no value => no value error_reporting => no value => no value expose_php => On => On extension_dir => /usr/local/php7/lib/php/extensions/no-debug-non-zts-20160303 => /usr/local/php7/lib/php/extensions/no-debug-non-zts-20160303 file_uploads => On => On hard_timeout => 2 => 2 highlight.comment => <font style="color: #FF8000">#FF8000</font> => <font style="color: #FF8000">#FF8000</font> highlight.default => <font style="color: #0000BB">#0000BB</font> => <font style="color: #0000BB">#0000BB</font> highlight.html => <font style="color: #000000">#000000</font> => <font style="color: #000000">#000000</font> highlight.keyword => <font style="color: #007700">#007700</font> => <font style="color: #007700">#007700</font> highlight.string => <font style="color: #DD0000">#DD0000</font> => <font style="color: #DD0000">#DD0000</font> html_errors => Off => Off ignore_repeated_errors => Off => Off ignore_repeated_source => Off => Off ignore_user_abort => Off => Off implicit_flush => On => On include_path => .:/usr/local/php7/lib/php => .:/usr/local/php7/lib/php input_encoding => no value => no value internal_encoding => no value => no value log_errors => Off => Off log_errors_max_len => 1024 => 1024 mail.add_x_header => Off => Off mail.force_extra_parameters => no value => no value mail.log => no value => no value max_execution_time => 0 => 0 max_file_uploads => 20 => 20 max_input_nesting_level => 64 => 64 max_input_time => -1 => -1 max_input_vars => 1000 => 1000 memory_limit => 128M => 128M open_basedir => no value => no value output_buffering => 0 => 0 output_encoding => no value => no value output_handler => no value => no value post_max_size => 8M => 8M precision => 14 => 14 realpath_cache_size => 4096K => 4096K realpath_cache_ttl => 120 => 120 register_argc_argv => On => On report_memleaks => On => On report_zend_debug => Off => Off request_order => no value => no value sendmail_from => no value => no value sendmail_path => -t -i => -t -i serialize_precision => -1 => -1 short_open_tag => On => On SMTP => localhost => localhost smtp_port => 25 => 25 sql.safe_mode => Off => Off sys_temp_dir => no value => no value track_errors => Off => Off unserialize_callback_func => no value => no value upload_max_filesize => 2M => 2M upload_tmp_dir => no value => no value user_dir => no value => no value user_ini.cache_ttl => 300 => 300 user_ini.filename => .user.ini => .user.ini variables_order => EGPCS => EGPCS xmlrpc_error_number => 0 => 0 xmlrpc_errors => Off => Off zend.assertions => 1 => 1 zend.detect_unicode => On => On zend.enable_gc => On => On zend.multibyte => Off => Off zend.script_encoding => no value => no value zend.signal_check => Off => Off ctype ctype functions => enabled curl cURL support => enabled cURL Information => 7.47.0 Age => 3 Features AsynchDNS => Yes CharConv => No Debug => No GSS-Negotiate => No IDN => Yes IPv6 => Yes krb4 => No Largefile => Yes libz => Yes NTLM => Yes NTLMWB => Yes SPNEGO => Yes SSL => Yes SSPI => No TLS-SRP => Yes HTTP2 => No GSSAPI => Yes KERBEROS5 => Yes UNIX_SOCKETS => Yes PSL => No Protocols => dict, file, ftp, ftps, gopher, http, https, imap, imaps, ldap, ldaps, pop3, pop3s, rtmp, rtsp, smb, smbs, smtp, smtps, telnet, tftp Host => x86_64-pc-linux-gnu SSL Version => OpenSSL/1.0.2g ZLib Version => 1.2.8 date date/time support => enabled "Olson" Timezone Database Version => 2017.2 Timezone Database => internal Default timezone => UTC Directive => Local Value => Master Value date.default_latitude => 31.7667 => 31.7667 date.default_longitude => 35.2333 => 35.2333 date.sunrise_zenith => 90.583333 => 90.583333 date.sunset_zenith => 90.583333 => 90.583333 date.timezone => no value => no value dom DOM/XML => enabled DOM/XML API Version => 20031129 libxml Version => 2.9.3 HTML Support => enabled XPath Support => enabled XPointer Support => enabled Schema Support => enabled RelaxNG Support => enabled exif EXIF Support => enabled EXIF Version => 1.4 $Id: 8bdc0c8f27c2c9dd1f7551f1f9fe3ab57a06a4b1 $ Supported EXIF Version => 0220 Supported filetypes => JPEG,TIFF Directive => Local Value => Master Value exif.decode_jis_intel => JIS => JIS exif.decode_jis_motorola => JIS => JIS exif.decode_unicode_intel => UCS-2LE => UCS-2LE exif.decode_unicode_motorola => UCS-2BE => UCS-2BE exif.encode_jis => no value => no value exif.encode_unicode => ISO-8859-15 => ISO-8859-15 fileinfo fileinfo support => enabled version => 1.0.5 libmagic => 522 filter Input Validation and Filtering => enabled Revision => $Id: cdc5e15bb616f10210b94ecd8789e66c927a375f $ Directive => Local Value => Master Value filter.default => unsafe_raw => unsafe_raw filter.default_flags => no value => no value gd GD Support => enabled GD Version => bundled (2.1.0 compatible) FreeType Support => enabled FreeType Linkage => with freetype FreeType Version => 2.6.1 GIF Read Support => enabled GIF Create Support => enabled JPEG Support => enabled libJPEG Version => 8 PNG Support => enabled libPNG Version => 1.2.54 WBMP Support => enabled XBM Support => enabled WebP Support => enabled Directive => Local Value => Master Value gd.jpeg_ignore_warning => 1 => 1 gettext GetText Support => enabled hash hash support => enabled Hashing Engines => md2 md4 md5 sha1 sha224 sha256 sha384 sha512/224 sha512/256 sha512 sha3-224 sha3-256 sha3-384 sha3-512 ripemd128 ripemd160 ripemd256 ripemd320 whirlpool tiger128,3 tiger160,3 tiger192,3 tiger128,4 tiger160,4 tiger192,4 snefru snefru256 gost gost-crypto adler32 crc32 crc32b fnv132 fnv1a32 fnv164 fnv1a64 joaat haval128,3 haval160,3 haval192,3 haval224,3 haval256,3 haval128,4 haval160,4 haval192,4 haval224,4 haval256,4 haval128,5 haval160,5 haval192,5 haval224,5 haval256,5 iconv iconv support => enabled iconv implementation => glibc iconv library version => 2.23 Directive => Local Value => Master Value iconv.input_encoding => no value => no value iconv.internal_encoding => no value => no value iconv.output_encoding => no value => no value intl Internationalization support => enabled version => 1.1.0 ICU version => 55.1 ICU Data version => 55.1 Directive => Local Value => Master Value intl.default_locale => no value => no value intl.error_level => 0 => 0 intl.use_exceptions => 0 => 0 json json support => enabled json version => 1.5.0 libxml libXML support => active libXML Compiled Version => 2.9.3 libXML Loaded Version => 20903 libXML streams => enabled mbstring Multibyte Support => enabled Multibyte string engine => libmbfl HTTP input encoding translation => disabled libmbfl version => 1.3.2 oniguruma version => 5.9.6 mbstring extension makes use of "streamable kanji code filter and converter", which is distributed under the GNU Lesser General Public License version 2.1. Multibyte (japanese) regex support => enabled Multibyte regex (oniguruma) backtrack check => On Multibyte regex (oniguruma) version => 5.9.6 Directive => Local Value => Master Value mbstring.detect_order => no value => no value mbstring.encoding_translation => Off => Off mbstring.func_overload => 0 => 0 mbstring.http_input => no value => no value mbstring.http_output => no value => no value mbstring.http_output_conv_mimetypes => ^(text/|application/xhtml\+xml) => ^(text/|application/xhtml\+xml) mbstring.internal_encoding => no value => no value mbstring.language => neutral => neutral mbstring.strict_detection => Off => Off mbstring.substitute_character => no value => no value mcrypt mcrypt support => enabled mcrypt_filter support => enabled Version => 2.5.8 Api No => 20021217 Supported ciphers => cast-128 gost rijndael-128 twofish arcfour cast-256 loki97 rijndael-192 saferplus wake blowfish-compat des rijndael-256 serpent xtea blowfish enigma rc2 tripledes Supported modes => cbc cfb ctr ecb ncfb nofb ofb stream Directive => Local Value => Master Value mcrypt.algorithms_dir => no value => no value mcrypt.modes_dir => no value => no value openssl OpenSSL support => enabled OpenSSL Library Version => OpenSSL 1.0.2g 1 Mar 2016 OpenSSL Header Version => OpenSSL 1.0.2g 1 Mar 2016 Openssl default config => /usr/lib/ssl/openssl.cnf Directive => Local Value => Master Value openssl.cafile => no value => no value openssl.capath => no value => no value pcntl pcntl support => enabled pcre PCRE (Perl Compatible Regular Expressions) Support => enabled PCRE Library Version => 8.38 2015-11-23 PCRE JIT Support => enabled Directive => Local Value => Master Value pcre.backtrack_limit => 1000000 => 1000000 pcre.jit => 1 => 1 pcre.recursion_limit => 100000 => 100000 PDO PDO support => enabled PDO drivers => pgsql, sqlite pdo_pgsql PDO Driver for PostgreSQL => enabled PostgreSQL(libpq) Version => 9.6.2 Module version => 7.1.4 Revision => $Id: 93712a6af603ebb2ee5792c5be271d4d03edfbde $ pdo_sqlite PDO Driver for SQLite 3.x => enabled SQLite Library => 3.15.1 pgsql PostgreSQL Support => enabled PostgreSQL(libpq) Version => 9.6.2 PostgreSQL(libpq) => PostgreSQL 9.6.2 on x86_64-pc-linux-gnu, compiled by gcc (Ubuntu 5.4.0-6ubuntu1~16.04.4) 5.4.0 20160609, 64-bit Multibyte character support => enabled SSL support => enabled Active Persistent Links => 0 Active Links => 0 Directive => Local Value => Master Value pgsql.allow_persistent => On => On pgsql.auto_reset_persistent => Off => Off pgsql.ignore_notice => Off => Off pgsql.log_notice => Off => Off pgsql.max_links => Unlimited => Unlimited pgsql.max_persistent => Unlimited => Unlimited Phar Phar: PHP Archive support => enabled Phar EXT version => 2.0.2 Phar API version => 1.1.1 SVN revision => $Id: 59c11f4e29768bfbbf6f41cb469abd81d8655850 $ Phar-based phar archives => enabled Tar-based phar archives => enabled ZIP-based phar archives => enabled gzip compression => enabled bzip2 compression => enabled Native OpenSSL support => enabled Phar based on pear/PHP_Archive, original concept by Davey Shafik. Phar fully realized by Gregory Beaver and Marcus Boerger. Portions of tar implementation Copyright (c) 2003-2009 Tim Kientzle. Directive => Local Value => Master Value phar.cache_list => no value => no value phar.readonly => On => On phar.require_hash => On => On posix Revision => $Id: b691ca925e7a085e6929579c4eba8fed0732e0ef $ pspell PSpell Support => enabled Reflection Reflection => enabled Version => $Id: a06522d025b0af3e6ba10a0f6964086b7e6f5458 $ session Session Support => enabled Registered save handlers => files user Registered serializer handlers => php_serialize php php_binary Directive => Local Value => Master Value session.auto_start => Off => Off session.cache_expire => 180 => 180 session.cache_limiter => nocache => nocache session.cookie_domain => no value => no value session.cookie_httponly => Off => Off session.cookie_lifetime => 0 => 0 session.cookie_path => / => / session.cookie_secure => Off => Off session.gc_divisor => 100 => 100 session.gc_maxlifetime => 1440 => 1440 session.gc_probability => 1 => 1 session.lazy_write => On => On session.name => PHPSESSID => PHPSESSID session.referer_check => no value => no value session.save_handler => files => files session.save_path => no value => no value session.serialize_handler => php => php session.sid_bits_per_character => 4 => 4 session.sid_length => 32 => 32 session.upload_progress.cleanup => On => On session.upload_progress.enabled => On => On session.upload_progress.freq => 1% => 1% session.upload_progress.min_freq => 1 => 1 session.upload_progress.name => PHP_SESSION_UPLOAD_PROGRESS => PHP_SESSION_UPLOAD_PROGRESS session.upload_progress.prefix => upload_progress_ => upload_progress_ session.use_cookies => On => On session.use_only_cookies => On => On session.use_strict_mode => Off => Off session.use_trans_sid => 0 => 0 shmop shmop support => enabled SimpleXML Simplexml support => enabled Revision => $Id: 7e5516dcdf2fe6ded7970eaeb6abd8d07df39a2a $ Schema support => enabled sockets Sockets Support => enabled SPL SPL support => enabled Interfaces => Countable, OuterIterator, RecursiveIterator, SeekableIterator, SplObserver, SplSubject Classes => AppendIterator, ArrayIterator, ArrayObject, BadFunctionCallException, BadMethodCallException, CachingIterator, CallbackFilterIterator, DirectoryIterator, DomainException, EmptyIterator, FilesystemIterator, FilterIterator, GlobIterator, InfiniteIterator, InvalidArgumentException, IteratorIterator, LengthException, LimitIterator, LogicException, MultipleIterator, NoRewindIterator, OutOfBoundsException, OutOfRangeException, OverflowException, ParentIterator, RangeException, RecursiveArrayIterator, RecursiveCachingIterator, RecursiveCallbackFilterIterator, RecursiveDirectoryIterator, RecursiveFilterIterator, RecursiveIteratorIterator, RecursiveRegexIterator, RecursiveTreeIterator, RegexIterator, RuntimeException, SplDoublyLinkedList, SplFileInfo, SplFileObject, SplFixedArray, SplHeap, SplMinHeap, SplMaxHeap, SplObjectStorage, SplPriorityQueue, SplQueue, SplStack, SplTempFileObject, UnderflowException, UnexpectedValueException sqlite3 SQLite3 support => enabled SQLite3 module version => 0.7-dev SQLite Library => 3.15.1 Directive => Local Value => Master Value sqlite3.extension_dir => no value => no value standard Dynamic Library Support => enabled Path to sendmail => -t -i Directive => Local Value => Master Value assert.active => 1 => 1 assert.bail => 0 => 0 assert.callback => no value => no value assert.exception => 0 => 0 assert.quiet_eval => 0 => 0 assert.warning => 1 => 1 auto_detect_line_endings => 0 => 0 default_socket_timeout => 60 => 60 from => no value => no value session.trans_sid_hosts => no value => no value session.trans_sid_tags => a=href,area=href,frame=src,form= => a=href,area=href,frame=src,form= url_rewriter.hosts => no value => no value url_rewriter.tags => form= => form= user_agent => no value => no value sysvmsg sysvmsg support => enabled Revision => $Id: 37aa0d90288b1385356784f17694f4c700575736 $ sysvsem Version => 7.1.4 sysvshm Version => 7.1.4 tokenizer Tokenizer Support => enabled xml XML Support => active XML Namespace Support => active libxml2 Version => 2.9.3 xmlreader XMLReader => enabled xmlrpc core library version => xmlrpc-epi v. 0.51 php extension version => 7.1.4 author => Dan Libby homepage => http://xmlrpc-epi.sourceforge.net open sourced by => Epinions.com xmlwriter XMLWriter => enabled xsl XSL => enabled libxslt Version => 1.1.28 libxslt compiled against libxml Version => 2.9.2 EXSLT => enabled libexslt Version => 1.1.28 zip Zip => enabled Zip version => 1.13.5 Libzip version => 1.1.2 zlib ZLib Support => enabled Stream Wrapper => compress.zlib:// Stream Filter => zlib.inflate, zlib.deflate Compiled Version => 1.2.8 Linked Version => 1.2.8 Directive => Local Value => Master Value zlib.output_compression => Off => Off zlib.output_compression_level => -1 => -1 zlib.output_handler => no value => no value Additional Modules Module Name Environment Variable => Value PYENV_VIRTUALENV_INIT => 1 LESSOPEN => | /usr/bin/lesspipe %s MAIL => /var/mail/zolf SSH_CLIENT => deleted USER => zolf LC_TIME => zh_CN.UTF-8 SHLVL => 2 TEST_PHP_SRCDIR => /home/zolf/src/php-7.1.4 HOME => /home/zolf SSH_TTY => deleted NVM_NODEJS_ORG_MIRROR => https://nodejs.org/dist NVM_BIN => /home/zolf/.nvm/versions/node/v6.9.2/bin PYENV_SHELL => bash LC_MONETARY => zh_CN.UTF-8 MAKEFLAGS => -j --jobserver-fds=3,4 NVM_PATH => /home/zolf/.nvm/versions/node/v6.9.2/lib/node NVM_DIR => /home/zolf/.nvm MAKE_TERMERR => /dev/pts/11 QT_QPA_PLATFORMTHEME => appmenu-qt5 LOGNAME => zolf TEST_PHP_EXECUTABLE => /home/zolf/src/php-7.1.4/sapi/cli/php _ => /home/zolf/src/php-7.1.4/sapi/cli/php XDG_SESSION_ID => 101 TERM => xterm-256color RBENV_SHELL => bash PATH => /usr/local/pgsql/bin:/home/zolf/.pyenv/plugins/pyenv-virtualenv/shims:/home/zolf/.pyenv/shims:/home/zolf/.pyenv/bin:/home/zolf/.rbenv/shims:/home/zolf/.rbenv/bin:/home/zolf/.nvm/versions/node/v6.9.2/bin:/usr/local/sbin:/usr/local/bin:/usr/sbin:/usr/bin:/sbin:/bin:/usr/games:/usr/local/games:/snap/bin NVM_IOJS_ORG_MIRROR => https://iojs.org/dist LC_ADDRESS => zh_CN.UTF-8 MAKELEVEL => 1 XDG_RUNTIME_DIR => /run/user/1000 LC_TELEPHONE => zh_CN.UTF-8 LANG => en_US.UTF-8 PYTHONSTARTUP => /home/zolf/.pystartup LS_COLORS => rs=0:di=01;34:ln=01;36:mh=00:pi=40;33:so=01;35:do=01;35:bd=40;33;01:cd=40;33;01:or=40;31;01:mi=00:su=37;41:sg=30;43:ca=30;41:tw=30;42:ow=34;42:st=37;44:ex=01;32:*.tar=01;31:*.tgz=01;31:*.arc=01;31:*.arj=01;31:*.taz=01;31:*.lha=01;31:*.lz4=01;31:*.lzh=01;31:*.lzma=01;31:*.tlz=01;31:*.txz=01;31:*.tzo=01;31:*.t7z=01;31:*.zip=01;31:*.z=01;31:*.Z=01;31:*.dz=01;31:*.gz=01;31:*.lrz=01;31:*.lz=01;31:*.lzo=01;31:*.xz=01;31:*.bz2=01;31:*.bz=01;31:*.tbz=01;31:*.tbz2=01;31:*.tz=01;31:*.deb=01;31:*.rpm=01;31:*.jar=01;31:*.war=01;31:*.ear=01;31:*.sar=01;31:*.rar=01;31:*.alz=01;31:*.ace=01;31:*.zoo=01;31:*.cpio=01;31:*.7z=01;31:*.rz=01;31:*.cab=01;31:*.jpg=01;35:*.jpeg=01;35:*.gif=01;35:*.bmp=01;35:*.pbm=01;35:*.pgm=01;35:*.ppm=01;35:*.tga=01;35:*.xbm=01;35:*.xpm=01;35:*.tif=01;35:*.tiff=01;35:*.png=01;35:*.svg=01;35:*.svgz=01;35:*.mng=01;35:*.pcx=01;35:*.mov=01;35:*.mpg=01;35:*.mpeg=01;35:*.m2v=01;35:*.mkv=01;35:*.webm=01;35:*.ogm=01;35:*.mp4=01;35:*.m4v=01;35:*.mp4v=01;35:*.vob=01;35:*.qt=01;35:*.nuv=01;35:*.wmv=01;35:*.asf=01;35:*.rm=01;35:*.rmvb=01;35:*.flc=01;35:*.avi=01;35:*.fli=01;35:*.flv=01;35:*.gl=01;35:*.dl=01;35:*.xcf=01;35:*.xwd=01;35:*.yuv=01;35:*.cgm=01;35:*.emf=01;35:*.ogv=01;35:*.ogx=01;35:*.aac=00;36:*.au=00;36:*.flac=00;36:*.m4a=00;36:*.mid=00;36:*.midi=00;36:*.mka=00;36:*.mp3=00;36:*.mpc=00;36:*.ogg=00;36:*.ra=00;36:*.wav=00;36:*.oga=00;36:*.opus=00;36:*.spx=00;36:*.xspf=00;36: SSH_AUTH_SOCK => deleted TEST_PHPDBG_EXECUTABLE => /home/zolf/src/php-7.1.4/sapi/phpdbg/phpdbg SHELL => /bin/bash LC_NAME => zh_CN.UTF-8 MAKE_TERMOUT => /dev/pts/11 LESSCLOSE => /usr/bin/lesspipe %s %s LC_MEASUREMENT => zh_CN.UTF-8 LC_IDENTIFICATION => zh_CN.UTF-8 PWD => /home/zolf/src/php-7.1.4 PYENV_ROOT => /home/zolf/.pyenv SSH_CONNECTION => deleted LC_NUMERIC => zh_CN.UTF-8 CC => cc LC_PAPER => zh_CN.UTF-8 MFLAGS => -j --jobserver-fds=3,4 MANPATH => /usr/local/pgsql/share/man:/home/zolf/.nvm/versions/node/v6.9.2/share/man:/usr/local/man:/usr/local/share/man:/usr/share/man PHP Variables Variable => Value $_SERVER['PYENV_VIRTUALENV_INIT'] => 1 $_SERVER['LESSOPEN'] => | /usr/bin/lesspipe %s $_SERVER['MAIL'] => /var/mail/zolf $_SERVER['SSH_CLIENT'] => deleted $_SERVER['USER'] => zolf $_SERVER['LC_TIME'] => zh_CN.UTF-8 $_SERVER['SHLVL'] => 2 $_SERVER['TEST_PHP_SRCDIR'] => /home/zolf/src/php-7.1.4 $_SERVER['HOME'] => /home/zolf $_SERVER['SSH_TTY'] => deleted $_SERVER['NVM_NODEJS_ORG_MIRROR'] => https://nodejs.org/dist $_SERVER['NVM_BIN'] => /home/zolf/.nvm/versions/node/v6.9.2/bin $_SERVER['PYENV_SHELL'] => bash $_SERVER['LC_MONETARY'] => zh_CN.UTF-8 $_SERVER['MAKEFLAGS'] => -j --jobserver-fds=3,4 $_SERVER['NVM_PATH'] => /home/zolf/.nvm/versions/node/v6.9.2/lib/node $_SERVER['NVM_DIR'] => /home/zolf/.nvm $_SERVER['MAKE_TERMERR'] => /dev/pts/11 $_SERVER['QT_QPA_PLATFORMTHEME'] => appmenu-qt5 $_SERVER['LOGNAME'] => zolf $_SERVER['TEST_PHP_EXECUTABLE'] => /home/zolf/src/php-7.1.4/sapi/cli/php $_SERVER['_'] => /home/zolf/src/php-7.1.4/sapi/cli/php $_SERVER['XDG_SESSION_ID'] => 101 $_SERVER['TERM'] => xterm-256color $_SERVER['RBENV_SHELL'] => bash $_SERVER['PATH'] => /usr/local/pgsql/bin:/home/zolf/.pyenv/plugins/pyenv-virtualenv/shims:/home/zolf/.pyenv/shims:/home/zolf/.pyenv/bin:/home/zolf/.rbenv/shims:/home/zolf/.rbenv/bin:/home/zolf/.nvm/versions/node/v6.9.2/bin:/usr/local/sbin:/usr/local/bin:/usr/sbin:/usr/bin:/sbin:/bin:/usr/games:/usr/local/games:/snap/bin $_SERVER['NVM_IOJS_ORG_MIRROR'] => https://iojs.org/dist $_SERVER['LC_ADDRESS'] => zh_CN.UTF-8 $_SERVER['MAKELEVEL'] => 1 $_SERVER['XDG_RUNTIME_DIR'] => /run/user/1000 $_SERVER['LC_TELEPHONE'] => zh_CN.UTF-8 $_SERVER['LANG'] => en_US.UTF-8 $_SERVER['PYTHONSTARTUP'] => /home/zolf/.pystartup $_SERVER['LS_COLORS'] => rs=0:di=01;34:ln=01;36:mh=00:pi=40;33:so=01;35:do=01;35:bd=40;33;01:cd=40;33;01:or=40;31;01:mi=00:su=37;41:sg=30;43:ca=30;41:tw=30;42:ow=34;42:st=37;44:ex=01;32:*.tar=01;31:*.tgz=01;31:*.arc=01;31:*.arj=01;31:*.taz=01;31:*.lha=01;31:*.lz4=01;31:*.lzh=01;31:*.lzma=01;31:*.tlz=01;31:*.txz=01;31:*.tzo=01;31:*.t7z=01;31:*.zip=01;31:*.z=01;31:*.Z=01;31:*.dz=01;31:*.gz=01;31:*.lrz=01;31:*.lz=01;31:*.lzo=01;31:*.xz=01;31:*.bz2=01;31:*.bz=01;31:*.tbz=01;31:*.tbz2=01;31:*.tz=01;31:*.deb=01;31:*.rpm=01;31:*.jar=01;31:*.war=01;31:*.ear=01;31:*.sar=01;31:*.rar=01;31:*.alz=01;31:*.ace=01;31:*.zoo=01;31:*.cpio=01;31:*.7z=01;31:*.rz=01;31:*.cab=01;31:*.jpg=01;35:*.jpeg=01;35:*.gif=01;35:*.bmp=01;35:*.pbm=01;35:*.pgm=01;35:*.ppm=01;35:*.tga=01;35:*.xbm=01;35:*.xpm=01;35:*.tif=01;35:*.tiff=01;35:*.png=01;35:*.svg=01;35:*.svgz=01;35:*.mng=01;35:*.pcx=01;35:*.mov=01;35:*.mpg=01;35:*.mpeg=01;35:*.m2v=01;35:*.mkv=01;35:*.webm=01;35:*.ogm=01;35:*.mp4=01;35:*.m4v=01;35:*.mp4v=01;35:*.vob=01;35:*.qt=01;35:*.nuv=01;35:*.wmv=01;35:*.asf=01;35:*.rm=01;35:*.rmvb=01;35:*.flc=01;35:*.avi=01;35:*.fli=01;35:*.flv=01;35:*.gl=01;35:*.dl=01;35:*.xcf=01;35:*.xwd=01;35:*.yuv=01;35:*.cgm=01;35:*.emf=01;35:*.ogv=01;35:*.ogx=01;35:*.aac=00;36:*.au=00;36:*.flac=00;36:*.m4a=00;36:*.mid=00;36:*.midi=00;36:*.mka=00;36:*.mp3=00;36:*.mpc=00;36:*.ogg=00;36:*.ra=00;36:*.wav=00;36:*.oga=00;36:*.opus=00;36:*.spx=00;36:*.xspf=00;36: $_SERVER['SSH_AUTH_SOCK'] => deleted $_SERVER['TEST_PHPDBG_EXECUTABLE'] => /home/zolf/src/php-7.1.4/sapi/phpdbg/phpdbg $_SERVER['SHELL'] => /bin/bash $_SERVER['LC_NAME'] => zh_CN.UTF-8 $_SERVER['MAKE_TERMOUT'] => /dev/pts/11 $_SERVER['LESSCLOSE'] => /usr/bin/lesspipe %s %s $_SERVER['LC_MEASUREMENT'] => zh_CN.UTF-8 $_SERVER['LC_IDENTIFICATION'] => zh_CN.UTF-8 $_SERVER['PWD'] => /home/zolf/src/php-7.1.4 $_SERVER['PYENV_ROOT'] => /home/zolf/.pyenv $_SERVER['SSH_CONNECTION'] => deleted $_SERVER['LC_NUMERIC'] => zh_CN.UTF-8 $_SERVER['CC'] => cc $_SERVER['LC_PAPER'] => zh_CN.UTF-8 $_SERVER['MFLAGS'] => -j --jobserver-fds=3,4 $_SERVER['MANPATH'] => /usr/local/pgsql/share/man:/home/zolf/.nvm/versions/node/v6.9.2/share/man:/usr/local/man:/usr/local/share/man:/usr/share/man $_SERVER['PHP_SELF'] => $_SERVER['SCRIPT_NAME'] => $_SERVER['SCRIPT_FILENAME'] => $_SERVER['PATH_TRANSLATED'] => $_SERVER['DOCUMENT_ROOT'] => $_SERVER['REQUEST_TIME_FLOAT'] => 1492486018.3167 $_SERVER['REQUEST_TIME'] => 1492486018 $_SERVER['argv'] => Array ( ) $_SERVER['argc'] => 0 $_ENV['PYENV_VIRTUALENV_INIT'] => 1 $_ENV['LESSOPEN'] => | /usr/bin/lesspipe %s $_ENV['MAIL'] => /var/mail/zolf $_ENV['SSH_CLIENT'] => deleted $_ENV['USER'] => zolf $_ENV['LC_TIME'] => zh_CN.UTF-8 $_ENV['SHLVL'] => 2 $_ENV['TEST_PHP_SRCDIR'] => /home/zolf/src/php-7.1.4 $_ENV['HOME'] => /home/zolf $_ENV['SSH_TTY'] => deleted $_ENV['NVM_NODEJS_ORG_MIRROR'] => https://nodejs.org/dist $_ENV['NVM_BIN'] => /home/zolf/.nvm/versions/node/v6.9.2/bin $_ENV['PYENV_SHELL'] => bash $_ENV['LC_MONETARY'] => zh_CN.UTF-8 $_ENV['MAKEFLAGS'] => -j --jobserver-fds=3,4 $_ENV['NVM_PATH'] => /home/zolf/.nvm/versions/node/v6.9.2/lib/node $_ENV['NVM_DIR'] => /home/zolf/.nvm $_ENV['MAKE_TERMERR'] => /dev/pts/11 $_ENV['QT_QPA_PLATFORMTHEME'] => appmenu-qt5 $_ENV['LOGNAME'] => zolf $_ENV['TEST_PHP_EXECUTABLE'] => /home/zolf/src/php-7.1.4/sapi/cli/php $_ENV['_'] => /home/zolf/src/php-7.1.4/sapi/cli/php $_ENV['XDG_SESSION_ID'] => 101 $_ENV['TERM'] => xterm-256color $_ENV['RBENV_SHELL'] => bash $_ENV['PATH'] => /usr/local/pgsql/bin:/home/zolf/.pyenv/plugins/pyenv-virtualenv/shims:/home/zolf/.pyenv/shims:/home/zolf/.pyenv/bin:/home/zolf/.rbenv/shims:/home/zolf/.rbenv/bin:/home/zolf/.nvm/versions/node/v6.9.2/bin:/usr/local/sbin:/usr/local/bin:/usr/sbin:/usr/bin:/sbin:/bin:/usr/games:/usr/local/games:/snap/bin $_ENV['NVM_IOJS_ORG_MIRROR'] => https://iojs.org/dist $_ENV['LC_ADDRESS'] => zh_CN.UTF-8 $_ENV['MAKELEVEL'] => 1 $_ENV['XDG_RUNTIME_DIR'] => /run/user/1000 $_ENV['LC_TELEPHONE'] => zh_CN.UTF-8 $_ENV['LANG'] => en_US.UTF-8 $_ENV['PYTHONSTARTUP'] => /home/zolf/.pystartup $_ENV['LS_COLORS'] => rs=0:di=01;34:ln=01;36:mh=00:pi=40;33:so=01;35:do=01;35:bd=40;33;01:cd=40;33;01:or=40;31;01:mi=00:su=37;41:sg=30;43:ca=30;41:tw=30;42:ow=34;42:st=37;44:ex=01;32:*.tar=01;31:*.tgz=01;31:*.arc=01;31:*.arj=01;31:*.taz=01;31:*.lha=01;31:*.lz4=01;31:*.lzh=01;31:*.lzma=01;31:*.tlz=01;31:*.txz=01;31:*.tzo=01;31:*.t7z=01;31:*.zip=01;31:*.z=01;31:*.Z=01;31:*.dz=01;31:*.gz=01;31:*.lrz=01;31:*.lz=01;31:*.lzo=01;31:*.xz=01;31:*.bz2=01;31:*.bz=01;31:*.tbz=01;31:*.tbz2=01;31:*.tz=01;31:*.deb=01;31:*.rpm=01;31:*.jar=01;31:*.war=01;31:*.ear=01;31:*.sar=01;31:*.rar=01;31:*.alz=01;31:*.ace=01;31:*.zoo=01;31:*.cpio=01;31:*.7z=01;31:*.rz=01;31:*.cab=01;31:*.jpg=01;35:*.jpeg=01;35:*.gif=01;35:*.bmp=01;35:*.pbm=01;35:*.pgm=01;35:*.ppm=01;35:*.tga=01;35:*.xbm=01;35:*.xpm=01;35:*.tif=01;35:*.tiff=01;35:*.png=01;35:*.svg=01;35:*.svgz=01;35:*.mng=01;35:*.pcx=01;35:*.mov=01;35:*.mpg=01;35:*.mpeg=01;35:*.m2v=01;35:*.mkv=01;35:*.webm=01;35:*.ogm=01;35:*.mp4=01;35:*.m4v=01;35:*.mp4v=01;35:*.vob=01;35:*.qt=01;35:*.nuv=01;35:*.wmv=01;35:*.asf=01;35:*.rm=01;35:*.rmvb=01;35:*.flc=01;35:*.avi=01;35:*.fli=01;35:*.flv=01;35:*.gl=01;35:*.dl=01;35:*.xcf=01;35:*.xwd=01;35:*.yuv=01;35:*.cgm=01;35:*.emf=01;35:*.ogv=01;35:*.ogx=01;35:*.aac=00;36:*.au=00;36:*.flac=00;36:*.m4a=00;36:*.mid=00;36:*.midi=00;36:*.mka=00;36:*.mp3=00;36:*.mpc=00;36:*.ogg=00;36:*.ra=00;36:*.wav=00;36:*.oga=00;36:*.opus=00;36:*.spx=00;36:*.xspf=00;36: $_ENV['SSH_AUTH_SOCK'] => deleted $_ENV['TEST_PHPDBG_EXECUTABLE'] => /home/zolf/src/php-7.1.4/sapi/phpdbg/phpdbg $_ENV['SHELL'] => /bin/bash $_ENV['LC_NAME'] => zh_CN.UTF-8 $_ENV['MAKE_TERMOUT'] => /dev/pts/11 $_ENV['LESSCLOSE'] => /usr/bin/lesspipe %s %s $_ENV['LC_MEASUREMENT'] => zh_CN.UTF-8 $_ENV['LC_IDENTIFICATION'] => zh_CN.UTF-8 $_ENV['PWD'] => /home/zolf/src/php-7.1.4 $_ENV['PYENV_ROOT'] => /home/zolf/.pyenv $_ENV['SSH_CONNECTION'] => deleted $_ENV['LC_NUMERIC'] => zh_CN.UTF-8 $_ENV['CC'] => cc $_ENV['LC_PAPER'] => zh_CN.UTF-8 $_ENV['MFLAGS'] => -j --jobserver-fds=3,4 $_ENV['MANPATH'] => /usr/local/pgsql/share/man:/home/zolf/.nvm/versions/node/v6.9.2/share/man:/usr/local/man:/usr/local/share/man:/usr/share/man PHP License This program is free software; you can redistribute it and/or modify it under the terms of the PHP License as published by the PHP Group and included in the distribution in the file: LICENSE This program is distributed in the hope that it will be useful, but WITHOUT ANY WARRANTY; without even the implied warranty of MERCHANTABILITY or FITNESS FOR A PARTICULAR PURPOSE. If you did not receive a copy of the PHP license, or have any questions about PHP licensing, please contact license@php.net.