PHP 7.2.0alpha1 make test report

From: Date: Thu, 08 Jun 2017 14:56:48 +0000
Subject: PHP 7.2.0alpha1 make test report
Groups: php.qa.reports 
Request: Send a blank email to php-qa-reports+get-33969@lists.php.net to get a copy of this message
Hi all, here are my 'make test' result on Slackware 14.0 with 33 failing tests. Best regards, Filippo

===================================================================== EXPECTED FAILED TEST SUMMARY --------------------------------------------------------------------- Test open_basedir configuration [tests/security/open_basedir_linkinfo.phpt] XFAIL REASON: BUG: open_basedir cannot delete symlink to prohibited file. See also bugs 48111 and 52176. Inconsistencies when accessing protected members [Zend/tests/access_modifiers_008.phpt] XFAIL REASON: Discussion: http://marc.info/?l=php-internals&m=120221184420957&w=2 Inconsistencies when accessing protected members - 2 [Zend/tests/access_modifiers_009.phpt] XFAIL REASON: Discussion: http://marc.info/?l=php-internals&m=120221184420957&w=2 Bug #48770 (call_user_func_array() fails to call parent from inheriting class) [Zend/tests/bug48770.phpt] XFAIL REASON: See Bug #48770 Bug #48770 (call_user_func_array() fails to call parent from inheriting class) [Zend/tests/bug48770_2.phpt] XFAIL REASON: See Bug #48770 Bug #48770 (call_user_func_array() fails to call parent from inheriting class) [Zend/tests/bug48770_3.phpt] XFAIL REASON: See Bug #48770 Initial value of static var in method depends on the include time of the class definition [Zend/tests/method_static_var.phpt] XFAIL REASON: Maybe not a bug DateTime::add() -- fall type2 type3 [ext/date/tests/DateTime_add-fall-type2-type3.phpt] XFAIL REASON: Various bugs exist DateTime::add() -- fall type3 type2 [ext/date/tests/DateTime_add-fall-type3-type2.phpt] XFAIL REASON: Various bugs exist DateTime::add() -- fall type3 type3 [ext/date/tests/DateTime_add-fall-type3-type3.phpt] XFAIL REASON: Various bugs exist DateTime::add() -- spring type2 type3 [ext/date/tests/DateTime_add-spring-type2-type3.phpt] XFAIL REASON: Various bugs exist DateTime::add() -- spring type3 type2 [ext/date/tests/DateTime_add-spring-type3-type2.phpt] XFAIL REASON: Various bugs exist DateTime::add() -- spring type3 type3 [ext/date/tests/DateTime_add-spring-type3-type3.phpt] XFAIL REASON: Various bugs exist DateTime::diff() -- fall type2 type3 [ext/date/tests/DateTime_diff-fall-type2-type3.phpt] XFAIL REASON: Various bugs exist DateTime::diff() -- fall type3 type2 [ext/date/tests/DateTime_diff-fall-type3-type2.phpt] XFAIL REASON: Various bugs exist DateTime::diff() -- fall type3 type3 [ext/date/tests/DateTime_diff-fall-type3-type3.phpt] XFAIL REASON: Various bugs exist DateTime::diff() -- spring type2 type3 [ext/date/tests/DateTime_diff-spring-type2-type3.phpt] XFAIL REASON: Various bugs exist DateTime::diff() -- spring type3 type2 [ext/date/tests/DateTime_diff-spring-type3-type2.phpt] XFAIL REASON: Various bugs exist DateTime::diff() -- spring type3 type3 [ext/date/tests/DateTime_diff-spring-type3-type3.phpt] XFAIL REASON: Various bugs exist DateTime::sub() -- fall type2 type3 [ext/date/tests/DateTime_sub-fall-type2-type3.phpt] XFAIL REASON: Various bugs exist DateTime::sub() -- fall type3 type2 [ext/date/tests/DateTime_sub-fall-type3-type2.phpt] XFAIL REASON: Various bugs exist DateTime::sub() -- fall type3 type3 [ext/date/tests/DateTime_sub-fall-type3-type3.phpt] XFAIL REASON: Various bugs exist DateTime::sub() -- spring type2 type3 [ext/date/tests/DateTime_sub-spring-type2-type3.phpt] XFAIL REASON: Various bugs exist DateTime::sub() -- spring type3 type2 [ext/date/tests/DateTime_sub-spring-type3-type2.phpt] XFAIL REASON: Various bugs exist DateTime::sub() -- spring type3 type3 [ext/date/tests/DateTime_sub-spring-type3-type3.phpt] XFAIL REASON: Various bugs exist RFC: DateTime and Daylight Saving Time Transitions (zone type 3, bd2) [ext/date/tests/rfc-datetime_and_daylight_saving_time-type3-bd2.phpt] XFAIL REASON: Still not quite right RFC: DateTime and Daylight Saving Time Transitions (zone type 3, fs) [ext/date/tests/rfc-datetime_and_daylight_saving_time-type3-fs.phpt] XFAIL REASON: Still not quite right Bug #42718 (unsafe_raw filter not applied when configured as default filter) [ext/filter/tests/bug42718.phpt] XFAIL REASON: FILTER_UNSAFE_RAW not applied when configured as default filter, even with flags Bug #67296 (filter_input doesn't validate variables) [ext/filter/tests/bug49184.phpt] XFAIL REASON: See Bug #49184 Bug #67167: filter_var(null,FILTER_VALIDATE_BOOLEAN,FILTER_NULL_ON_FAILURE) returns null [ext/filter/tests/bug67167.02.phpt] XFAIL REASON: Requires php_zval_filter to not use convert_to_string for all filters. Phar: bug #69958: Segfault in Phar::convertToData on invalid file [ext/phar/tests/bug69958.phpt] XFAIL REASON: Still has memory leaks, see https://bugs.php.net/bug.php?id=70005 updateTimestamp never called when session data is empty [ext/session/tests/bug71162.phpt] XFAIL REASON: Current session module is designed to write empty session always. In addition, current session module only supports SessionHandlerInterface only from PHP 7.0. Bug #73529 session_decode() silently fails on wrong input [ext/session/tests/bug73529.phpt] XFAIL REASON: session_decode() does not return proper status. Bug #70219 Use after free vulnerability in session deserializer [ext/standard/tests/serialize/bug70219.phpt] XFAIL REASON: Unfinished merge, needs fix. Bug #70470 (Built-in server truncates headers spanning over TCP packets) [sapi/cli/tests/bug70470.phpt] XFAIL REASON: bug is not fixed yet ===================================================================== ===================================================================== FAILED TEST SUMMARY --------------------------------------------------------------------- Bug #23922 (scope doesn't properly propagate into internal functions) [tests/lang/bug23922.phpt] Bug #70208 (scope information must be preserved with assert()) [Zend/tests/assert/bug70208.phpt] Test exception doesn't cause RSHUTDOWN bypass, variation 0 [Zend/tests/exception_011.phpt] Test exception doesn't cause RSHUTDOWN bypass, variation 1 [Zend/tests/exception_012.phpt] Bug #61948 (CURLOPT_COOKIEFILE '' raises open_basedir restriction) [ext/curl/tests/bug61948.phpt] References to result sets - mysqlnd (no copies but references) [ext/mysqli/tests/mysqli_result_references_mysqlnd.phpt] Bug #71443 (Segfault using built-in webserver with intl using symfony) [ext/opcache/tests/bug71443.phpt] Bug #60860 (session.save_handler=user without defined function core dumps) [ext/session/tests/bug60860.phpt] Bug #66481: Calls to session_name() segfault when session.name is null. [ext/session/tests/bug66481.phpt] Test session_set_save_handler() : calling default handler when save_handler=user [ext/session/tests/session_set_save_handler_class_014.phpt] assert() [ext/standard/tests/assert/assert.phpt] catch assert() errors [ext/standard/tests/assert/assert02.phpt] assert() - set callback using ini_set() [ext/standard/tests/assert/assert03.phpt] misc assert() tests tests [ext/standard/tests/assert/assert04.phpt] assert() - basic - check that assert runs when assert.active is set to 1. [ext/standard/tests/assert/assert_basic.phpt] assert() - basic - correct call back values before and after assert. [ext/standard/tests/assert/assert_basic2.phpt] assert() - basic - Test that bailout works [ext/standard/tests/assert/assert_basic3.phpt] assert() - basic - check switch on warnings using assert_options. [ext/standard/tests/assert/assert_basic5.phpt] assert() - basic - Test that bailout works [ext/standard/tests/assert/assert_basic6.phpt] assert() - basic - accept closures as callback. [ext/standard/tests/assert/assert_closures.phpt] assert() - error - give assert nonsense string with quiet_eval on then off [ext/standard/tests/assert/assert_error.phpt] assert() - error - invalid params [ext/standard/tests/assert/assert_error1.phpt] assert() - basic - Test that bailout works [ext/standard/tests/assert/assert_error2.phpt] assert() - basic - Test recoverable error [ext/standard/tests/assert/assert_error3.phpt] assert() - basic - Test recoverable error [ext/standard/tests/assert/assert_error4.phpt] assert() - variation - test callback options using ini_get/ini_set/assert_options [ext/standard/tests/assert/assert_variation.phpt] Bug #73303: Scope not inherited by eval in assert() [ext/standard/tests/assert/bug73303.phpt] Bug #41655 (open_basedir bypass via glob()) 1/2 [ext/standard/tests/file/bug41655_1.phpt] Test glob() function: ensure no platform difference, variation 3 [ext/standard/tests/file/glob_variation5.phpt] Test setlocale() function : usage variations - Setting all available locales in the platform [ext/standard/tests/strings/setlocale_variation2.phpt] Test breaks on HANDLE_EXCEPTION [sapi/phpdbg/tests/exceptions_003.phpt] Stepping with exceptions must not be stuck at CATCH [sapi/phpdbg/tests/stepping_001.phpt] Bug #69487 (SAPI may truncate POST data) [sapi/tests/bug69487.phpt] ===================================================================== ===================================================================== TEST RESULT SUMMARY --------------------------------------------------------------------- Exts skipped : 36 Exts tested : 38 --------------------------------------------------------------------- Number of tests : 15501 11670 Tests skipped : 3831 ( 24.7%) -------- Tests warned : 0 ( 0.0%) ( 0.0%) Tests failed : 33 ( 0.2%) ( 0.3%) Expected fail : 35 ( 0.2%) ( 0.3%) Tests passed : 11602 ( 74.8%) ( 99.4%) --------------------------------------------------------------------- Time taken : 457 seconds ===================================================================== ===================================================================== EXPECTED FAILED TEST SUMMARY --------------------------------------------------------------------- Test open_basedir configuration [tests/security/open_basedir_linkinfo.phpt] XFAIL REASON: BUG: open_basedir cannot delete symlink to prohibited file. See also bugs 48111 and 52176. Inconsistencies when accessing protected members [Zend/tests/access_modifiers_008.phpt] XFAIL REASON: Discussion: http://marc.info/?l=php-internals&m=120221184420957&w=2 Inconsistencies when accessing protected members - 2 [Zend/tests/access_modifiers_009.phpt] XFAIL REASON: Discussion: http://marc.info/?l=php-internals&m=120221184420957&w=2 Bug #48770 (call_user_func_array() fails to call parent from inheriting class) [Zend/tests/bug48770.phpt] XFAIL REASON: See Bug #48770 Bug #48770 (call_user_func_array() fails to call parent from inheriting class) [Zend/tests/bug48770_2.phpt] XFAIL REASON: See Bug #48770 Bug #48770 (call_user_func_array() fails to call parent from inheriting class) [Zend/tests/bug48770_3.phpt] XFAIL REASON: See Bug #48770 Initial value of static var in method depends on the include time of the class definition [Zend/tests/method_static_var.phpt] XFAIL REASON: Maybe not a bug DateTime::add() -- fall type2 type3 [ext/date/tests/DateTime_add-fall-type2-type3.phpt] XFAIL REASON: Various bugs exist DateTime::add() -- fall type3 type2 [ext/date/tests/DateTime_add-fall-type3-type2.phpt] XFAIL REASON: Various bugs exist DateTime::add() -- fall type3 type3 [ext/date/tests/DateTime_add-fall-type3-type3.phpt] XFAIL REASON: Various bugs exist DateTime::add() -- spring type2 type3 [ext/date/tests/DateTime_add-spring-type2-type3.phpt] XFAIL REASON: Various bugs exist DateTime::add() -- spring type3 type2 [ext/date/tests/DateTime_add-spring-type3-type2.phpt] XFAIL REASON: Various bugs exist DateTime::add() -- spring type3 type3 [ext/date/tests/DateTime_add-spring-type3-type3.phpt] XFAIL REASON: Various bugs exist DateTime::diff() -- fall type2 type3 [ext/date/tests/DateTime_diff-fall-type2-type3.phpt] XFAIL REASON: Various bugs exist DateTime::diff() -- fall type3 type2 [ext/date/tests/DateTime_diff-fall-type3-type2.phpt] XFAIL REASON: Various bugs exist DateTime::diff() -- fall type3 type3 [ext/date/tests/DateTime_diff-fall-type3-type3.phpt] XFAIL REASON: Various bugs exist DateTime::diff() -- spring type2 type3 [ext/date/tests/DateTime_diff-spring-type2-type3.phpt] XFAIL REASON: Various bugs exist DateTime::diff() -- spring type3 type2 [ext/date/tests/DateTime_diff-spring-type3-type2.phpt] XFAIL REASON: Various bugs exist DateTime::diff() -- spring type3 type3 [ext/date/tests/DateTime_diff-spring-type3-type3.phpt] XFAIL REASON: Various bugs exist DateTime::sub() -- fall type2 type3 [ext/date/tests/DateTime_sub-fall-type2-type3.phpt] XFAIL REASON: Various bugs exist DateTime::sub() -- fall type3 type2 [ext/date/tests/DateTime_sub-fall-type3-type2.phpt] XFAIL REASON: Various bugs exist DateTime::sub() -- fall type3 type3 [ext/date/tests/DateTime_sub-fall-type3-type3.phpt] XFAIL REASON: Various bugs exist DateTime::sub() -- spring type2 type3 [ext/date/tests/DateTime_sub-spring-type2-type3.phpt] XFAIL REASON: Various bugs exist DateTime::sub() -- spring type3 type2 [ext/date/tests/DateTime_sub-spring-type3-type2.phpt] XFAIL REASON: Various bugs exist DateTime::sub() -- spring type3 type3 [ext/date/tests/DateTime_sub-spring-type3-type3.phpt] XFAIL REASON: Various bugs exist RFC: DateTime and Daylight Saving Time Transitions (zone type 3, bd2) [ext/date/tests/rfc-datetime_and_daylight_saving_time-type3-bd2.phpt] XFAIL REASON: Still not quite right RFC: DateTime and Daylight Saving Time Transitions (zone type 3, fs) [ext/date/tests/rfc-datetime_and_daylight_saving_time-type3-fs.phpt] XFAIL REASON: Still not quite right Bug #42718 (unsafe_raw filter not applied when configured as default filter) [ext/filter/tests/bug42718.phpt] XFAIL REASON: FILTER_UNSAFE_RAW not applied when configured as default filter, even with flags Bug #67296 (filter_input doesn't validate variables) [ext/filter/tests/bug49184.phpt] XFAIL REASON: See Bug #49184 Bug #67167: filter_var(null,FILTER_VALIDATE_BOOLEAN,FILTER_NULL_ON_FAILURE) returns null [ext/filter/tests/bug67167.02.phpt] XFAIL REASON: Requires php_zval_filter to not use convert_to_string for all filters. Phar: bug #69958: Segfault in Phar::convertToData on invalid file [ext/phar/tests/bug69958.phpt] XFAIL REASON: Still has memory leaks, see https://bugs.php.net/bug.php?id=70005 updateTimestamp never called when session data is empty [ext/session/tests/bug71162.phpt] XFAIL REASON: Current session module is designed to write empty session always. In addition, current session module only supports SessionHandlerInterface only from PHP 7.0. Bug #73529 session_decode() silently fails on wrong input [ext/session/tests/bug73529.phpt] XFAIL REASON: session_decode() does not return proper status. Bug #70219 Use after free vulnerability in session deserializer [ext/standard/tests/serialize/bug70219.phpt] XFAIL REASON: Unfinished merge, needs fix. Bug #70470 (Built-in server truncates headers spanning over TCP packets) [sapi/cli/tests/bug70470.phpt] XFAIL REASON: bug is not fixed yet ===================================================================== ===================================================================== FAILED TEST SUMMARY --------------------------------------------------------------------- Bug #23922 (scope doesn't properly propagate into internal functions) [tests/lang/bug23922.phpt] Bug #70208 (scope information must be preserved with assert()) [Zend/tests/assert/bug70208.phpt] Test exception doesn't cause RSHUTDOWN bypass, variation 0 [Zend/tests/exception_011.phpt] Test exception doesn't cause RSHUTDOWN bypass, variation 1 [Zend/tests/exception_012.phpt] Bug #61948 (CURLOPT_COOKIEFILE '' raises open_basedir restriction) [ext/curl/tests/bug61948.phpt] References to result sets - mysqlnd (no copies but references) [ext/mysqli/tests/mysqli_result_references_mysqlnd.phpt] Bug #71443 (Segfault using built-in webserver with intl using symfony) [ext/opcache/tests/bug71443.phpt] Bug #60860 (session.save_handler=user without defined function core dumps) [ext/session/tests/bug60860.phpt] Bug #66481: Calls to session_name() segfault when session.name is null. [ext/session/tests/bug66481.phpt] Test session_set_save_handler() : calling default handler when save_handler=user [ext/session/tests/session_set_save_handler_class_014.phpt] assert() [ext/standard/tests/assert/assert.phpt] catch assert() errors [ext/standard/tests/assert/assert02.phpt] assert() - set callback using ini_set() [ext/standard/tests/assert/assert03.phpt] misc assert() tests tests [ext/standard/tests/assert/assert04.phpt] assert() - basic - check that assert runs when assert.active is set to 1. [ext/standard/tests/assert/assert_basic.phpt] assert() - basic - correct call back values before and after assert. [ext/standard/tests/assert/assert_basic2.phpt] assert() - basic - Test that bailout works [ext/standard/tests/assert/assert_basic3.phpt] assert() - basic - check switch on warnings using assert_options. [ext/standard/tests/assert/assert_basic5.phpt] assert() - basic - Test that bailout works [ext/standard/tests/assert/assert_basic6.phpt] assert() - basic - accept closures as callback. [ext/standard/tests/assert/assert_closures.phpt] assert() - error - give assert nonsense string with quiet_eval on then off [ext/standard/tests/assert/assert_error.phpt] assert() - error - invalid params [ext/standard/tests/assert/assert_error1.phpt] assert() - basic - Test that bailout works [ext/standard/tests/assert/assert_error2.phpt] assert() - basic - Test recoverable error [ext/standard/tests/assert/assert_error3.phpt] assert() - basic - Test recoverable error [ext/standard/tests/assert/assert_error4.phpt] assert() - variation - test callback options using ini_get/ini_set/assert_options [ext/standard/tests/assert/assert_variation.phpt] Bug #73303: Scope not inherited by eval in assert() [ext/standard/tests/assert/bug73303.phpt] Bug #41655 (open_basedir bypass via glob()) 1/2 [ext/standard/tests/file/bug41655_1.phpt] Test glob() function: ensure no platform difference, variation 3 [ext/standard/tests/file/glob_variation5.phpt] Test setlocale() function : usage variations - Setting all available locales in the platform [ext/standard/tests/strings/setlocale_variation2.phpt] Test breaks on HANDLE_EXCEPTION [sapi/phpdbg/tests/exceptions_003.phpt] Stepping with exceptions must not be stuck at CATCH [sapi/phpdbg/tests/stepping_001.phpt] Bug #69487 (SAPI may truncate POST data) [sapi/tests/bug69487.phpt] ===================================================================== ================================================================================ /tmp/php-7.2.0alpha1/tests/lang/bug23922.phpt ================================================================================ ================================================================================ 001+ 001- Deprecated: assert(): Calling assert() with a string argument is deprecated in %s on line %d ================================================================================ ================================================================================ /tmp/php-7.2.0alpha1/Zend/tests/assert/bug70208.phpt ================================================================================ int(1) ================================================================================ 001- Deprecated: assert(): Calling assert() with a string argument is deprecated in %s on line %d ================================================================================ ================================================================================ /tmp/php-7.2.0alpha1/Zend/tests/exception_011.phpt ================================================================================ ================================================================================ 001+ 001- Fatal error: Uncaught AssertionError: assert(false) in %sexception_011.php:%d 002- Stack trace: 003- #0 %sexception_011.php(%d): assert(false, 'assert(false)') 004- #1 {main} 005- thrown in %sexception_011.php on line %d ================================================================================ ================================================================================ /tmp/php-7.2.0alpha1/Zend/tests/exception_012.phpt ================================================================================ Deprecated: Function create_function() is deprecated in /tmp/php-7.2.0alpha1/Zend/tests/exception_012.php on line 3 ================================================================================ 002- 003- Fatal error: Uncaught AssertionError: assert(false) in %sexception_012.php(%d) : runtime-created function:%d 004- Stack trace: 005- #0 %sexception_012.php(%d) : runtime-created function(%d): assert(false, 'assert(false)') 006- #1 %sexception_012.php(%d): __lambda_func() 007- #2 {main} 008- thrown in %sexception_012.php(%d) : runtime-created function on line %d ================================================================================ ================================================================================ /tmp/php-7.2.0alpha1/ext/curl/tests/bug61948.phpt ================================================================================ bool(true) bool(true) bool(true) ================================================================================ 003+ bool(true) 003- 004- Warning: curl_setopt(): open_basedir restriction in effect. File(/xxx/bar) is not within the allowed path(s): (/tmp) in %sbug61948.php on line %d 005- bool(false) ================================================================================ ================================================================================ /tmp/php-7.2.0alpha1/ext/mysqli/tests/mysqli_result_references_mysqlnd.phpt ================================================================================ Warning: mysqli_connect(): (HY000/1045): Access denied for user 'root'@'localhost' (using password: NO) in /tmp/php-7.2.0alpha1/ext/mysqli/tests/connect.inc on line 96 Cannot connect to the server using host=localhost, user=root, passwd=***, dbname=test, port=3306, socket= ================================================================================ 001+ Warning: mysqli_connect(): (HY000/1045): Access denied for user 'root'@'localhost' (using password: NO) in /tmp/php-7.2.0alpha1/ext/mysqli/tests/connect.inc on line 96 002+ Cannot connect to the server using host=localhost, user=root, passwd=***, dbname=test, port=3306, socket= 001- array(1) refcount(%d){ 002- [0]=> 003- array(4) refcount(%d){ 004- ["row_ref"]=> 005- &NULL 006- ["row_copy"]=> 007- array(2) refcount(1){ 008- ["id"]=> 009- string(1) "1" refcount(%d) 010- ["label"]=> 011- string(1) "a" refcount(%d) 012- } 013- ["id_ref"]=> 014- string(1) "1" refcount(%d) 015- ["id_copy"]=> 016- string(1) "1" refcount(%d) 017- } 018- } 019- array(2) refcount(%d){ 020- [0]=> 021- array(4) refcount(%d){ 022- ["row_ref"]=> 023- &NULL 024- ["row_copy"]=> 025- array(2) refcount(%d){ 026- ["id"]=> 027- string(1) "1" refcount(%d) 028- ["label"]=> 029- string(1) "a" refcount(%d) 030- } 031- ["id_ref"]=> 032- string(1) "1" refcount(%d) 033- ["id_copy"]=> 034- string(1) "1" refcount(%d) 035- } 036- [1]=> 037- array(5) refcount(%d){ 038- ["row_ref"]=> 039- &array(2) refcount(%d){ 040- ["id"]=> 041- &string(1) "2" refcount(%d) 042- ["label"]=> 043- string(1) "b" refcount(%d) 044- } 045- ["row_copy"]=> 046- array(2) refcount(%d){ 047- ["id"]=> 048- string(1) "2" refcount(%d) 049- ["label"]=> 050- string(1) "b" refcount(%d) 051- } 052- ["id_ref"]=> 053- &string(1) "2" refcount(%d) 054- ["id_copy"]=> 055- string(1) "2" refcount(%d) 056- ["id_copy_mod"]=> 057- int(2) 058- } 059- } 060- done! ================================================================================ ================================================================================ /tmp/php-7.2.0alpha1/ext/opcache/tests/bug71443.phpt ================================================================================ Termsig=11 ================================================================================ 001+ Termsig=11 001- okey ================================================================================ ================================================================================ /tmp/php-7.2.0alpha1/ext/session/tests/bug60860.phpt ================================================================================ ok ================================================================================ 001- PHP Recoverable fatal error: PHP Startup: Cannot set 'user' save handler by ini_set() or session_module_name() in Unknown on line 0 ================================================================================ ================================================================================ /tmp/php-7.2.0alpha1/ext/session/tests/bug66481.phpt ================================================================================ Warning: PHP Startup: session.name cannot be a numeric or empty '' in Unknown on line 0 string(9) "PHPSESSID" string(3) "foo" ================================================================================ 001- PHP Warning: PHP Startup: session.name cannot be a numeric or empty '' in Unknown on line 0 002- ================================================================================ ================================================================================ /tmp/php-7.2.0alpha1/ext/session/tests/session_set_save_handler_class_014.phpt ================================================================================ *** Testing session_set_save_handler() : calling default handler when save_handler=user *** ================================================================================ 001- PHP Recoverable fatal error: PHP Startup: Cannot set 'user' save handler by ini_set() or session_module_name() in Unknown on line 0 ================================================================================ ================================================================================ /tmp/php-7.2.0alpha1/ext/standard/tests/assert/assert.phpt ================================================================================ ================================================================================ 001+ 001- assertion failed 22,"$a != 0" 002- class assertion failed 25,"$a != 0" 003- class assertion failed 29,"$a != 0" ================================================================================ ================================================================================ /tmp/php-7.2.0alpha1/ext/standard/tests/assert/assert02.phpt ================================================================================ done ================================================================================ 001+ done 001- Deprecated: assert(): Calling assert() with a string argument is deprecated in %s on line %d 002- 003- Deprecated: assert(): Calling assert() with a string argument is deprecated in %s on line %d 004- 005- Notice: Undefined variable: a in %sassert02.php(%d) : assert code on line 1 006- 007- Warning: assert(): Assertion "$a" failed in %sassert02.php on line %d 008- 009- Deprecated: assert(): Calling assert() with a string argument is deprecated in %s on line %d 010- Failure evaluating code: 011- aa=sd+as+safsafasfasafsaf 012- 013- Deprecated: assert(): Calling assert() with a string argument is deprecated in %s on line %d 014- 015- Warning: assert(): Assertion "0" failed in %sassert02.php on line %d 016- 017- Deprecated: assert(): Calling assert() with a string argument is deprecated in %s on line %d 018- 019- Fatal error: Uncaught ParseError: syntax error, unexpected '=', expecting ';' in %s(%d) : assert code:1 020- Stack trace: 021- #0 %s(%d): assert('aa=sd+as+safsaf...') 022- #1 {main} 023- 024- Next Error: Failure evaluating code: 025- aa=sd+as+safsafasfasafsaf in %s:%d 026- Stack trace: 027- #0 %s(%d): assert('aa=sd+as+safsaf...') 028- #1 {main} 029- thrown in %s on line %d ================================================================================ ================================================================================ /tmp/php-7.2.0alpha1/ext/standard/tests/assert/assert03.phpt ================================================================================ ==DONE== ================================================================================ 001- Deprecated: assert(): Calling assert() with a string argument is deprecated in %s on line %d 002- assertion failed - a - %d,"$a != 0" 003- 004- Deprecated: assert(): Calling assert() with a string argument is deprecated in %s on line %d 005- assertion failed - b - %d,"$a != 0" ================================================================================ ================================================================================ /tmp/php-7.2.0alpha1/ext/standard/tests/assert/assert04.phpt ================================================================================ Warning: assert_options() expects at most 2 parameters, 3 given in /tmp/php-7.2.0alpha1/ext/standard/tests/assert/assert04.php on line 12 Warning: assert_options() expects parameter 1 to be integer, string given in /tmp/php-7.2.0alpha1/ext/standard/tests/assert/assert04.php on line 16 not reached ================================================================================ 001- Warning: assert() expects at most 2 parameters, 3 given in %s on line %d 002- 004+ not reached 006- 007- Warning: assert(): assert(0) failed in %s on line %d 008- 009- Warning: assert(): assert(0) failed in %s on line %d ================================================================================ ================================================================================ /tmp/php-7.2.0alpha1/ext/standard/tests/assert/assert_basic.phpt ================================================================================ bool(true) bool(true) bool(true) bool(true) ================================================================================ 001+ bool(true) 002+ bool(true) 003+ bool(true) 001- Deprecated: assert(): Calling assert() with a string argument is deprecated in %s on line %d 002- f1 called 003- bool(false) 004- 005- Deprecated: assert(): Calling assert() with a string argument is deprecated in %s on line %d 007- f1 called 008- bool(false) 009- bool(true) ================================================================================ ================================================================================ /tmp/php-7.2.0alpha1/ext/standard/tests/assert/assert_basic2.phpt ================================================================================ string(2) "f1" string(2) "f1" string(2) "f2" ================================================================================ 002- f1 called 003- 004- Warning: assert(): assert(0) failed in %s on line 13 007- f2 called 008- 009- Warning: assert(): assert(0) failed in %s on line 17 ================================================================================ ================================================================================ /tmp/php-7.2.0alpha1/ext/standard/tests/assert/assert_basic3.phpt ================================================================================ int(0) bool(true) If this is printed BAIL hasn't worked ================================================================================ 002+ bool(true) 003+ If this is printed BAIL hasn't worked 002- 003- Deprecated: assert(): Calling assert() with a string argument is deprecated in %s on line %d 004- f1 called 005- 006- Warning: assert(): assert($sa): "0 != 0" failed in %s on line 10 ================================================================================ ================================================================================ /tmp/php-7.2.0alpha1/ext/standard/tests/assert/assert_basic5.phpt ================================================================================ int(0) bool(true) bool(true) int(1) ================================================================================ 002+ bool(true) 003+ bool(true) 004+ int(1) 002- 003- Deprecated: assert(): Calling assert() with a string argument is deprecated in %s on line %d 004- f1 called 005- 006- Warning: assert(): assert($sa): "0 != 0" failed in %s on line 10 007- bool(false) 008- 009- Deprecated: assert(): Calling assert() with a string argument is deprecated in %s on line %d 010- bool(true) 011- int(1) ================================================================================ ================================================================================ /tmp/php-7.2.0alpha1/ext/standard/tests/assert/assert_basic6.phpt ================================================================================ int(0) bool(true) If this is printed BAIL hasn't worked ================================================================================ 002+ bool(true) 003+ If this is printed BAIL hasn't worked 002- 003- Deprecated: assert(): Calling assert() with a string argument is deprecated in %s on line %d 004- f1 called 005- 006- Warning: assert(): 0 is 0: "0 != 0" failed in %s on line 10 ================================================================================ ================================================================================ /tmp/php-7.2.0alpha1/ext/standard/tests/assert/assert_closures.phpt ================================================================================ ================================================================================ 001- Hello World! 003- Warning: assert(): assert(0) failed in %s on line %d ================================================================================ ================================================================================ /tmp/php-7.2.0alpha1/ext/standard/tests/assert/assert_error.phpt ================================================================================ bool(true) int(0) bool(true) ================================================================================ 001- Deprecated: assert(): Calling assert() with a string argument is deprecated in %s on line %d 002- 003- Warning: Use of undefined constant threemeninaboat - assumed 'threemeninaboat' (this will throw an Error in a future version of PHP) in %s(9) : assert code on line 1 006- 007- Deprecated: assert(): Calling assert() with a string argument is deprecated in %s on line %d ================================================================================ ================================================================================ /tmp/php-7.2.0alpha1/ext/standard/tests/assert/assert_error1.phpt ================================================================================ Warning: assert_options() expects at most 2 parameters, 3 given in /tmp/php-7.2.0alpha1/ext/standard/tests/assert/assert_error1.php on line 14 NULL Warning: assert_options() expects parameter 1 to be integer, string given in /tmp/php-7.2.0alpha1/ext/standard/tests/assert/assert_error1.php on line 18 NULL bool(true) bool(true) ================================================================================ 006+ bool(true) 007+ bool(true) 006- 007- Warning: assert() expects at most 2 parameters, 3 given in %s on line %d 008- NULL 009- 010- Deprecated: assert(): Calling assert() with a string argument is deprecated in %s on line %d ================================================================================ ================================================================================ /tmp/php-7.2.0alpha1/ext/standard/tests/assert/assert_error2.phpt ================================================================================ int(0) bool(true) If this is printed BAIL hasn't worked ================================================================================ 002+ bool(true) 003+ If this is printed BAIL hasn't worked 002- 003- Deprecated: assert(): Calling assert() with a string argument is deprecated in %s on line %d 004- 005- Warning: assert(): Assertion "0 != 0" failed in %s on line 9 006- 007- Fatal error: Uncaught ArgumentCountError: Too few arguments to function f1(), 3 passed and exactly 4 expected in %sassert_error2.php:2 008- Stack trace: 009- #0 [internal function]: f1('%s', 9, '0 != 0') 010- #1 %sassert_error2.php(9): assert('0 != 0') 011- #2 {main} 012- thrown in %sassert_error2.php on line 2 ================================================================================ ================================================================================ /tmp/php-7.2.0alpha1/ext/standard/tests/assert/assert_error3.phpt ================================================================================ bool(true) ================================================================================ 001+ bool(true) 001- Deprecated: assert(): Calling assert() with a string argument is deprecated in %s on line %d 002- 003- Fatal error: Uncaught ParseError: syntax error, unexpected '$', expecting ';' in %s(%d) : assert code:1 004- Stack trace: 005- #0 %s(%d): assert('0 $ 0') 006- #1 {main} 007- 008- Next Error: Failure evaluating code: 009- 0 $ 0 in %s:%d 010- Stack trace: 011- #0 %s(%d): assert('0 $ 0') 012- #1 {main} 013- thrown in %s on line %d ================================================================================ ================================================================================ /tmp/php-7.2.0alpha1/ext/standard/tests/assert/assert_error4.phpt ================================================================================ bool(true) ================================================================================ 001+ bool(true) 001- Deprecated: assert(): Calling assert() with a string argument is deprecated in %s on line %d 002- 003- Fatal error: Uncaught ParseError: syntax error, unexpected '$', expecting ';' in %s(%d) : assert code:1 004- Stack trace: 005- #0 %s(%d): assert('0 $ 0', 'Describing what...') 006- #1 {main} 007- 008- Next Error: Failure evaluating code: 009- Describing what was asserted:"0 $ 0" in %s:%d 010- Stack trace: 011- #0 %s(%d): assert('0 $ 0', 'Describing what...') 012- #1 {main} 013- thrown in %s on line %d ================================================================================ ================================================================================ /tmp/php-7.2.0alpha1/ext/standard/tests/assert/assert_variation.phpt ================================================================================ Initial values: assert_options(ASSERT_CALLBACK) => [f1] Initial values: ini.get("assert.callback") => [f1] bool(true) Change callback function using ini.set and test return value string(2) "f1" assert_options(ASSERT_CALLBACK) => [f2] ini.get("assert.callback") => [f2] bool(true) Change callback function using assert_options and test return value string(2) "f2" assert_options(ASSERT_CALLBACK) => [f3] ini.get("assert.callback") => [f2] bool(true) Reset the name of the callback routine to a class method and check that it works string(2) "f3" assert_options(ASSERT_CALLBACK) => [c1] ini.get("assert.callback") => [f2] bool(true) Reset callback options to use a class method string(2) "c1" array(2) { [0]=> string(2) "c1" [1]=> string(6) "assert" } ini.get("assert.callback") => [f2] bool(true) Reset callback options to use an object method array(2) { [0]=> string(2) "c1" [1]=> string(6) "assert" } array(2) { [0]=> &object(c1)#1 (0) { } [1]=> string(6) "assert" } ini.get("assert.callback") => [f2] bool(true) ================================================================================ 003+ bool(true) 004- Deprecated: assert(): Calling assert() with a string argument is deprecated in %s on line %d 005- f1 called 006- bool(false) 007- 009+ bool(true) 013- Deprecated: assert(): Calling assert() with a string argument is deprecated in %s on line %d 014- f2 called 015- bool(false) 016- 015+ bool(true) 021+ bool(true) 022- Deprecated: assert(): Calling assert() with a string argument is deprecated in %s on line %d 023- f3 called 024- bool(false) 025- 031- Deprecated: assert(): Calling assert() with a string argument is deprecated in %s on line %d 032- bool(false) 033- 033+ bool(true) 045- Deprecated: assert(): Calling assert() with a string argument is deprecated in %s on line %d 046- 047- Deprecated: Non-static method c1::assert() should not be called statically in %s on line 53 048- Class assertion failed 53, "0 != 0" 049- bool(false) 050- 051+ bool(true) 067- 068- Deprecated: assert(): Calling assert() with a string argument is deprecated in %s on line %d 069- Class assertion failed 61, "0 != 0" 070- bool(false) ================================================================================ ================================================================================ /tmp/php-7.2.0alpha1/ext/standard/tests/assert/bug73303.phpt ================================================================================ Success ================================================================================ 001- Deprecated: assert(): Calling assert() with a string argument is deprecated in %s on line %d ================================================================================ ================================================================================ /tmp/php-7.2.0alpha1/ext/standard/tests/file/bug41655_1.phpt ================================================================================ array(0) { } Done ================================================================================ 001+ array(0) { 002+ } 001- bool(false) ================================================================================ ================================================================================ /tmp/php-7.2.0alpha1/ext/standard/tests/file/glob_variation5.phpt ================================================================================ array(0) { } array(0) { } array(0) { } array(0) { } array(0) { } array(0) { } bool(true) ==DONE== ================================================================================ 001+ array(0) { 002+ } 003+ array(0) { 004+ } 005+ array(0) { 006+ } 007+ array(0) { 008+ } 009+ array(0) { 010+ } 011+ array(0) { 012+ } 001- bool(false) 002- bool(false) 003- bool(false) 004- bool(false) 005- bool(false) 006- bool(false) ================================================================================ ================================================================================ /tmp/php-7.2.0alpha1/ext/standard/tests/strings/setlocale_variation2.phpt ================================================================================ *** Testing setlocale() : usage variations *** -- Test setlocale() with all available locale in the system -- No of locales found on the machine = 440 No of setlocale() success = 439 Expected no of failures = 0 Test FAILED Names of locale() for which setlocale() failed ... array(1) { [0]=> string(14) "hy_AM.armscii8" } Done ================================================================================ 006+ Test FAILED 007+ Names of locale() for which setlocale() failed ... 008+ array(1) { 009+ [0]=> 010+ string(14) "hy_AM.armscii8" 011+ } 006- Test PASSED ================================================================================ ================================================================================ /tmp/php-7.2.0alpha1/sapi/phpdbg/tests/exceptions_003.phpt ================================================================================ [Successful compilation of /tmp/php-7.2.0alpha1/sapi/phpdbg/tests/exceptions_003.php] prompt> [Breakpoint #0 added at /tmp/php-7.2.0alpha1/sapi/phpdbg/tests/exceptions_003.php:5] prompt> [Breakpoint #0 at /tmp/php-7.2.0alpha1/sapi/phpdbg/tests/exceptions_003.php:5, hits: 1] >00005: x(); 00006: } finally { 00007: print "ok\n"; prompt> [L0 0x8b81a28 HANDLE_EXCEPTION /tmp/php-7.2.0alpha1/sapi/phpdbg/tests/exceptions_003.php] >00005: x(); 00006: } finally { 00007: print "ok\n"; prompt> [L7 0xb6e7a070 ECHO<1> "ok\n" /tmp/php-7.2.0alpha1/sapi/phpdbg/tests/exceptions_003.php] >00007: print "ok\n"; 00008: } 00009: } catch (Error $e) { prompt> ok [L7 0xb6e7a08c FAST_RET ~0 try-catch(0) /tmp/php-7.2.0alpha1/sapi/phpdbg/tests/exceptions_003.php] [L9 0xb6e7a0c4 CATCH<-196> "Error" $e 1 /tmp/php-7.2.0alpha1/sapi/phpdbg/tests/exceptions_003.php] >00005: x(); 00006: } finally { 00007: print "ok\n"; prompt> [L10 0xb6e7a0e0 ECHO<1> "caught\n" /tmp/php-7.2.0alpha1/sapi/phpdbg/tests/exceptions_003.php] >00010: print "caught\n"; 00011: } 00012: prompt> caught [L14 0xb6e7a0fc RETURN<-1> 1 /tmp/php-7.2.0alpha1/sapi/phpdbg/tests/exceptions_003.php] >00014: prompt> ================================================================================ 017+ [L9 0xb6e7a0c4 CATCH<-196> "Error" $e 1 /tmp/php-7.2.0alpha1/sapi/phpdbg/tests/exceptions_003.php] 017- [L9 %s CATCH<-224> "Error" $e 1 %s] ================================================================================ ================================================================================ /tmp/php-7.2.0alpha1/sapi/phpdbg/tests/stepping_001.phpt ================================================================================ [Successful compilation of /tmp/php-7.2.0alpha1/sapi/phpdbg/tests/stepping_001.php] prompt> [Breakpoint #0 added at ZEND_THROW] prompt> [Breakpoint #0 in ZEND_THROW at /tmp/php-7.2.0alpha1/sapi/phpdbg/tests/stepping_001.php:4, hits: 1] >00004: throw new Exception; 00005: } 00006: prompt> [L0 0x8b81a28 HANDLE_EXCEPTION /tmp/php-7.2.0alpha1/sapi/phpdbg/tests/stepping_001.php] >00004: throw new Exception; 00005: } 00006: prompt> [L0 0x8b81a28 HANDLE_EXCEPTION /tmp/php-7.2.0alpha1/sapi/phpdbg/tests/stepping_001.php] [L9 0xb6e7b070 CATCH<-112> "Exception" $e 1 /tmp/php-7.2.0alpha1/sapi/phpdbg/tests/stepping_001.php] >00008: foo(); 00009: } catch (Exception $e) { 00010: echo "ok"; prompt> [L10 0xb6e7b08c ECHO "ok" /tmp/php-7.2.0alpha1/sapi/phpdbg/tests/stepping_001.php] >00010: echo "ok"; 00011: } finally { 00012: echo " ... ok"; prompt> ok [L11 0xb6e7b0a8 FAST_CALL J8 ~0 /tmp/php-7.2.0alpha1/sapi/phpdbg/tests/stepping_001.php] >00011: } finally { 00012: echo " ... ok"; 00013: } prompt> [L12 0xb6e7b0e0 ECHO " ... ok" /tmp/php-7.2.0alpha1/sapi/phpdbg/tests/stepping_001.php] >00012: echo " ... ok"; 00013: } 00014: prompt> ... ok [L12 0xb6e7b0fc FAST_RET ~0 /tmp/php-7.2.0alpha1/sapi/phpdbg/tests/stepping_001.php] [L11 0xb6e7b0c4 JMP J10 /tmp/php-7.2.0alpha1/sapi/phpdbg/tests/stepping_001.php] >00011: } finally { 00012: echo " ... ok"; 00013: } prompt> [L14 0xb6e7b118 RETURN<-1> 1 /tmp/php-7.2.0alpha1/sapi/phpdbg/tests/stepping_001.php] >00014: prompt> ================================================================================ 012+ [L9 0xb6e7b070 CATCH<-112> "Exception" $e 1 /tmp/php-7.2.0alpha1/sapi/phpdbg/tests/stepping_001.php] 012- [L9 %s CATCH<-128> "Exception" $e 1 %s] ================================================================================ ================================================================================ /tmp/php-7.2.0alpha1/sapi/tests/bug69487.phpt ================================================================================ bool(true) int(16387) ================================================================================ 001+ bool(true) 002+ int(16387) 001- Warning: Unknown: Unable to create temporary file, Check permissions in temporary files directory. in Unknown on line 0 002- 003- Warning: Unknown: POST data can't be buffered; all data discarded in Unknown on line 0 004- 005- Warning: Cannot modify header information - headers already sent in Unknown on line 0 006- bool(false) 007- int(0) ================================================================================ ================================================================================ BUILD ENVIRONMENT ================================================================================ OS: Linux - Linux pdc 3.2.83-smp #2 SMP Mon Oct 31 12:35:24 CDT 2016 i686 Autoconf: autoconf (GNU Autoconf) 2.69 Copyright (C) 2012 Free Software Foundation, Inc. License GPLv3+/Autoconf: GNU GPL version 3 or later <http://gnu.org/licenses/gpl.html>, <http://gnu.org/licenses/exceptions.html> This is free software: you are free to change and redistribute it. There is NO WARRANTY, to the extent permitted by law. Written by David J. MacKenzie and Akim Demaille. Bundled Libtool: ltmain.sh (GNU libtool) 1.5.26 (1.1220.2.492 2008/01/30 06:40:56) Copyright (C) 2008 Free Software Foundation, Inc. This is free software; see the source for copying conditions. There is NO warranty; not even for MERCHANTABILITY or FITNESS FOR A PARTICULAR PURPOSE. System Libtool: libtool (GNU libtool) 2.4.2 Written by Gordon Matzigkeit <gord@gnu.ai.mit.edu>, 1996 Copyright (C) 2011 Free Software Foundation, Inc. This is free software; see the source for copying conditions. There is NO warranty; not even for MERCHANTABILITY or FITNESS FOR A PARTICULAR PURPOSE. Compiler: Reading specs from /usr/lib/gcc/i486-slackware-linux/4.7.1/specs COLLECT_GCC=cc COLLECT_LTO_WRAPPER=/usr/libexec/gcc/i486-slackware-linux/4.7.1/lto-wrapper Target: i486-slackware-linux Configured with: ../gcc-4.7.1/configure --prefix=/usr --libdir=/usr/lib --mandir=/usr/man --infodir=/usr/info --enable-shared --enable-bootstrap --enable-languages=ada,c,c++,fortran,go,java,lto,objc --enable-threads=posix --enable-checking=release --enable-objc-gc --with-system-zlib --with-python-dir=/lib/python2.7/site-packages --disable-libunwind-exceptions --enable-__cxa_atexit --enable-libssp --enable-lto --with-gnu-ld --verbose --enable-java-home --with-java-home=/usr/lib/jvm/jre --with-jvm-root-dir=/usr/lib/jvm --with-jvm-jar-dir=/usr/lib/jvm/jvm-exports --with-arch-directory=i386 --with-antlr-jar=/root/slackware-current/source/d/gcc/antlr-runtime-3.4.jar --enable-java-awt=gtk --disable-gtktest --with-arch=i486 --target=i486-slackware-linux --build=i486-slackware-linux --host=i486-slackware-linux Thread model: posix gcc version 4.7.1 (GCC) Bison: bison (GNU Bison) 2.5.1 Scritto da Robert Corbett e Richard Stallman. Copyright (C) 2012 Free Software Foundation, Inc. Questo e' software libero; vedere il sorgente per le condizioni cui e' sottoposta la copia. NON c'è ALCUNA garanzia, neanche di COMMERCIABILITA` o di ADEGUATEZZA AD UN PARTICOLARE SCOPO. Libraries: linux-gate.so.1 (0xffffe000) libcrypt.so.1 => /lib/libcrypt.so.1 (0xb76c2000) libresolv.so.2 => /lib/libresolv.so.2 (0xb76a9000) librt.so.1 => /lib/librt.so.1 (0xb76a0000) libm.so.6 => /lib/libm.so.6 (0xb7674000) libdl.so.2 => /lib/libdl.so.2 (0xb766e000) libnsl.so.1 => /lib/libnsl.so.1 (0xb7653000) libz.so.1 => /lib/libz.so.1 (0xb763d000) libxml2.so.2 => /usr/lib/libxml2.so.2 (0xb74e4000) liblzma.so.5 => /lib/liblzma.so.5 (0xb74bf000) libssl.so.1 => /lib/libssl.so.1 (0xb7459000) libcrypto.so.1 => /lib/libcrypto.so.1 (0xb72a0000) libc.so.6 => /lib/libc.so.6 (0xb711b000) libpthread.so.0 => /lib/libpthread.so.0 (0xb7101000) /lib/ld-linux.so.2 (0xb7708000) ================================================================================ PHPINFO ================================================================================ phpinfo() PHP Version => 7.2.0alpha1 System => Linux pdc 3.2.83-smp #2 SMP Mon Oct 31 12:35:24 CDT 2016 i686 Build Date => Jun 8 2017 16:26:31 Configure Command => './configure' '--prefix=/usr/local/php-7.2.0alpha1' '--enable-bcmath=shared' '--enable-cgi' '--enable-mbstring=shared' '--enable-opcache=shared' '--enable-zip=shared' '--with-bz2=shared' '--with-curl=shared' '--with-freetype-dir=/usr' '--with-gd=shared' '--with-imap-ssl=shared,/usr/local/lib/c-client' '--with-imap=shared,/usr/local/lib/c-client' '--with-jpeg-dir=/usr/include' '--with-mysqli=shared,mysqlnd' '--with-openssl=shared' '--with-pdo-mysql=shared,mysqlnd' '--with-png-dir=/usr' '--with-zlib=shared' Server API => Command Line Interface Virtual Directory Support => disabled Configuration File (php.ini) Path => /usr/local/php-7.2.0alpha1/lib Loaded Configuration File => /usr/local/php-7.2.0alpha1/lib/php.ini Scan this dir for additional .ini files => (none) Additional .ini files parsed => (none) PHP API => 20160731 PHP Extension => 20160303 Zend Extension => 320160731 Zend Extension Build => API320160731,NTS PHP Extension Build => API20160303,NTS Debug Build => no Thread Safety => disabled Zend Signal Handling => enabled Zend Memory Manager => enabled Zend Multibyte Support => provided by mbstring IPv6 Support => enabled DTrace Support => disabled Registered PHP Streams => compress.bzip2, php, file, glob, data, http, ftp, https, ftps, compress.zlib, zip, phar Registered Stream Socket Transports => tcp, udp, unix, udg, ssl, sslv3, tls, tlsv1.0, tlsv1.1, tlsv1.2 Registered Stream Filters => convert.iconv.*, bzip2.*, string.rot13, string.toupper, string.tolower, string.strip_tags, convert.*, consumed, dechunk, zlib.* This program makes use of the Zend Scripting Language Engine: Zend Engine v3.2.0-dev, Copyright (c) 1998-2017 Zend Technologies _______________________________________________________________________ Configuration bcmath BCMath support => enabled Directive => Local Value => Master Value bcmath.scale => 0 => 0 bz2 BZip2 Support => Enabled Stream Wrapper support => compress.bzip2:// Stream Filter support => bzip2.decompress, bzip2.compress BZip2 Version => 1.0.6, 6-Sept-2010 Core PHP Version => 7.2.0alpha1 Directive => Local Value => Master Value allow_url_fopen => On => On allow_url_include => Off => Off arg_separator.input => & => & arg_separator.output => & => & auto_append_file => no value => no value auto_globals_jit => On => On auto_prepend_file => no value => no value browscap => no value => no value default_charset => UTF-8 => UTF-8 default_mimetype => text/html => text/html disable_classes => no value => no value disable_functions => no value => no value display_errors => STDERR => STDERR display_startup_errors => On => On doc_root => no value => no value docref_ext => no value => no value docref_root => no value => no value enable_dl => Off => Off enable_post_data_reading => On => On error_append_string => no value => no value error_log => /var/log/apache2/PHP_errors/PHP_errors.log => /var/log/apache2/PHP_errors/PHP_errors.log error_prepend_string => no value => no value error_reporting => 32767 => 32767 expose_php => Off => Off extension_dir => /usr/local/php-7.2.0alpha1/lib/php/extensions/no-debug-non-zts-20160303 => /usr/local/php-7.2.0alpha1/lib/php/extensions/no-debug-non-zts-20160303 file_uploads => On => On hard_timeout => 2 => 2 highlight.comment => <font style="color: #FF8000">#FF8000</font> => <font style="color: #FF8000">#FF8000</font> highlight.default => <font style="color: #0000BB">#0000BB</font> => <font style="color: #0000BB">#0000BB</font> highlight.html => <font style="color: #000000">#000000</font> => <font style="color: #000000">#000000</font> highlight.keyword => <font style="color: #007700">#007700</font> => <font style="color: #007700">#007700</font> highlight.string => <font style="color: #DD0000">#DD0000</font> => <font style="color: #DD0000">#DD0000</font> html_errors => Off => Off ignore_repeated_errors => Off => Off ignore_repeated_source => Off => Off ignore_user_abort => Off => Off implicit_flush => On => On include_path => . => . input_encoding => no value => no value internal_encoding => no value => no value log_errors => On => On log_errors_max_len => 1024 => 1024 mail.add_x_header => On => On mail.force_extra_parameters => no value => no value mail.log => no value => no value max_execution_time => 0 => 0 max_file_uploads => 20 => 20 max_input_nesting_level => 64 => 64 max_input_time => -1 => -1 max_input_vars => 1000 => 1000 memory_limit => 1G => 1G open_basedir => no value => no value output_buffering => 0 => 0 output_encoding => no value => no value output_handler => no value => no value post_max_size => 40M => 40M precision => 14 => 14 realpath_cache_size => 4096K => 4096K realpath_cache_ttl => 120 => 120 register_argc_argv => On => On report_memleaks => On => On report_zend_debug => Off => Off request_order => GP => GP sendmail_from => no value => no value sendmail_path => /usr/sbin/sendmail -t -i => /usr/sbin/sendmail -t -i serialize_precision => -1 => -1 short_open_tag => Off => Off SMTP => localhost => localhost smtp_port => 25 => 25 sys_temp_dir => /tmp/ => /tmp/ track_errors => Off => Off unserialize_callback_func => no value => no value upload_max_filesize => 40M => 40M upload_tmp_dir => /tmp/ => /tmp/ user_dir => no value => no value user_ini.cache_ttl => 300 => 300 user_ini.filename => .user.ini => .user.ini variables_order => GPCS => GPCS xmlrpc_error_number => 0 => 0 xmlrpc_errors => Off => Off zend.assertions => -1 => -1 zend.detect_unicode => On => On zend.enable_gc => On => On zend.multibyte => Off => Off zend.script_encoding => no value => no value zend.signal_check => Off => Off ctype ctype functions => enabled curl cURL support => enabled cURL Information => 7.51.0 Age => 3 Features AsynchDNS => No CharConv => No Debug => No GSS-Negotiate => No IDN => No IPv6 => Yes krb4 => No Largefile => Yes libz => Yes NTLM => Yes NTLMWB => Yes SPNEGO => No SSL => Yes SSPI => No TLS-SRP => Yes HTTP2 => No GSSAPI => No KERBEROS5 => No UNIX_SOCKETS => Yes PSL => No Protocols => dict, file, ftp, ftps, gopher, http, https, imap, imaps, ldap, ldaps, pop3, pop3s, rtsp, smb, smbs, smtp, smtps, telnet, tftp Host => i686-pc-linux-gnu SSL Version => OpenSSL/1.0.1u ZLib Version => 1.2.6 date date/time support => enabled "Olson" Timezone Database Version => 2017.2 Timezone Database => internal Default timezone => Europe/Rome Directive => Local Value => Master Value date.default_latitude => 31.7667 => 31.7667 date.default_longitude => 35.2333 => 35.2333 date.sunrise_zenith => 90.583333 => 90.583333 date.sunset_zenith => 90.583333 => 90.583333 date.timezone => Europe/Rome => Europe/Rome dom DOM/XML => enabled DOM/XML API Version => 20031129 libxml Version => 2.9.4 HTML Support => enabled XPath Support => enabled XPointer Support => enabled Schema Support => enabled RelaxNG Support => enabled fileinfo fileinfo support => enabled version => 1.0.5 libmagic => 529 filter Input Validation and Filtering => enabled Revision => $Id: cdc5e15bb616f10210b94ecd8789e66c927a375f $ Directive => Local Value => Master Value filter.default => unsafe_raw => unsafe_raw filter.default_flags => no value => no value gd GD Support => enabled GD Version => bundled (2.1.0 compatible) FreeType Support => enabled FreeType Linkage => with freetype FreeType Version => 2.5.5 GIF Read Support => enabled GIF Create Support => enabled JPEG Support => enabled libJPEG Version => 8 PNG Support => enabled libPNG Version => 1.4.20 WBMP Support => enabled XBM Support => enabled Directive => Local Value => Master Value gd.jpeg_ignore_warning => 1 => 1 hash hash support => enabled Hashing Engines => md2 md4 md5 sha1 sha224 sha256 sha384 sha512/224 sha512/256 sha512 sha3-224 sha3-256 sha3-384 sha3-512 ripemd128 ripemd160 ripemd256 ripemd320 whirlpool tiger128,3 tiger160,3 tiger192,3 tiger128,4 tiger160,4 tiger192,4 snefru snefru256 gost gost-crypto adler32 crc32 crc32b fnv132 fnv1a32 fnv164 fnv1a64 joaat haval128,3 haval160,3 haval192,3 haval224,3 haval256,3 haval128,4 haval160,4 haval192,4 haval224,4 haval256,4 haval128,5 haval160,5 haval192,5 haval224,5 haval256,5 iconv iconv support => enabled iconv implementation => glibc iconv library version => 2.15 Directive => Local Value => Master Value iconv.input_encoding => no value => no value iconv.internal_encoding => no value => no value iconv.output_encoding => no value => no value imap IMAP c-Client Version => 2010 SSL Support => enabled json json support => enabled json version => 1.5.0 libxml libXML support => active libXML Compiled Version => 2.9.4 libXML Loaded Version => 20904 libXML streams => enabled mbstring Multibyte Support => enabled Multibyte string engine => libmbfl HTTP input encoding translation => disabled libmbfl version => 1.3.2 oniguruma version => 6.3.0 mbstring extension makes use of "streamable kanji code filter and converter", which is distributed under the GNU Lesser General Public License version 2.1. Multibyte (japanese) regex support => enabled Multibyte regex (oniguruma) backtrack check => On Multibyte regex (oniguruma) version => 6.3.0 Directive => Local Value => Master Value mbstring.detect_order => no value => no value mbstring.encoding_translation => Off => Off mbstring.func_overload => 0 => 0 mbstring.http_input => no value => no value mbstring.http_output => no value => no value mbstring.http_output_conv_mimetypes => ^(text/|application/xhtml\+xml) => ^(text/|application/xhtml\+xml) mbstring.internal_encoding => no value => no value mbstring.language => neutral => neutral mbstring.strict_detection => Off => Off mbstring.substitute_character => no value => no value mysqli MysqlI Support => enabled Client API library version => mysqlnd 5.0.12-dev - 20150407 - $Id: b396954eeb2d1d9ed7902b8bae237b287f21ad9e $ Active Persistent Links => 0 Inactive Persistent Links => 0 Active Links => 0 Directive => Local Value => Master Value mysqli.allow_local_infile => On => On mysqli.allow_persistent => On => On mysqli.default_host => no value => no value mysqli.default_port => 3306 => 3306 mysqli.default_pw => no value => no value mysqli.default_socket => /var/run/mysqld/mysqld-5.6.sock => /var/run/mysqld/mysqld-5.6.sock mysqli.default_user => no value => no value mysqli.max_links => Unlimited => Unlimited mysqli.max_persistent => Unlimited => Unlimited mysqli.reconnect => Off => Off mysqli.rollback_on_cached_plink => Off => Off mysqlnd mysqlnd => enabled Version => mysqlnd 5.0.12-dev - 20150407 - $Id: b396954eeb2d1d9ed7902b8bae237b287f21ad9e $ Compression => supported core SSL => supported extended SSL => supported Command buffer size => 4096 Read buffer size => 32768 Read timeout => 86400 Collecting statistics => No Collecting memory statistics => No Tracing => n/a Loaded plugins => mysqlnd,debug_trace,auth_plugin_mysql_native_password,auth_plugin_mysql_clear_password,auth_plugin_sha256_password API Extensions => mysqli,pdo_mysql mysqlnd statistics => bytes_sent => 0 bytes_received => 0 packets_sent => 0 packets_received => 0 protocol_overhead_in => 0 protocol_overhead_out => 0 bytes_received_ok_packet => 0 bytes_received_eof_packet => 0 bytes_received_rset_header_packet => 0 bytes_received_rset_field_meta_packet => 0 bytes_received_rset_row_packet => 0 bytes_received_prepare_response_packet => 0 bytes_received_change_user_packet => 0 packets_sent_command => 0 packets_received_ok => 0 packets_received_eof => 0 packets_received_rset_header => 0 packets_received_rset_field_meta => 0 packets_received_rset_row => 0 packets_received_prepare_response => 0 packets_received_change_user => 0 result_set_queries => 0 non_result_set_queries => 0 no_index_used => 0 bad_index_used => 0 slow_queries => 0 buffered_sets => 0 unbuffered_sets => 0 ps_buffered_sets => 0 ps_unbuffered_sets => 0 flushed_normal_sets => 0 flushed_ps_sets => 0 ps_prepared_never_executed => 0 ps_prepared_once_executed => 0 rows_fetched_from_server_normal => 0 rows_fetched_from_server_ps => 0 rows_buffered_from_client_normal => 0 rows_buffered_from_client_ps => 0 rows_fetched_from_client_normal_buffered => 0 rows_fetched_from_client_normal_unbuffered => 0 rows_fetched_from_client_ps_buffered => 0 rows_fetched_from_client_ps_unbuffered => 0 rows_fetched_from_client_ps_cursor => 0 rows_affected_normal => 0 rows_affected_ps => 0 rows_skipped_normal => 0 rows_skipped_ps => 0 copy_on_write_saved => 0 copy_on_write_performed => 0 command_buffer_too_small => 0 connect_success => 0 connect_failure => 0 connection_reused => 0 reconnect => 0 pconnect_success => 0 active_connections => 0 active_persistent_connections => 0 explicit_close => 0 implicit_close => 0 disconnect_close => 0 in_middle_of_command_close => 0 explicit_free_result => 0 implicit_free_result => 0 explicit_stmt_close => 0 implicit_stmt_close => 0 mem_emalloc_count => 0 mem_emalloc_amount => 0 mem_ecalloc_count => 0 mem_ecalloc_amount => 0 mem_erealloc_count => 0 mem_erealloc_amount => 0 mem_efree_count => 0 mem_efree_amount => 0 mem_malloc_count => 0 mem_malloc_amount => 0 mem_calloc_count => 0 mem_calloc_amount => 0 mem_realloc_count => 0 mem_realloc_amount => 0 mem_free_count => 0 mem_free_amount => 0 mem_estrndup_count => 0 mem_strndup_count => 0 mem_estrdup_count => 0 mem_strdup_count => 0 mem_edupl_count => 0 mem_dupl_count => 0 proto_text_fetched_null => 0 proto_text_fetched_bit => 0 proto_text_fetched_tinyint => 0 proto_text_fetched_short => 0 proto_text_fetched_int24 => 0 proto_text_fetched_int => 0 proto_text_fetched_bigint => 0 proto_text_fetched_decimal => 0 proto_text_fetched_float => 0 proto_text_fetched_double => 0 proto_text_fetched_date => 0 proto_text_fetched_year => 0 proto_text_fetched_time => 0 proto_text_fetched_datetime => 0 proto_text_fetched_timestamp => 0 proto_text_fetched_string => 0 proto_text_fetched_blob => 0 proto_text_fetched_enum => 0 proto_text_fetched_set => 0 proto_text_fetched_geometry => 0 proto_text_fetched_other => 0 proto_binary_fetched_null => 0 proto_binary_fetched_bit => 0 proto_binary_fetched_tinyint => 0 proto_binary_fetched_short => 0 proto_binary_fetched_int24 => 0 proto_binary_fetched_int => 0 proto_binary_fetched_bigint => 0 proto_binary_fetched_decimal => 0 proto_binary_fetched_float => 0 proto_binary_fetched_double => 0 proto_binary_fetched_date => 0 proto_binary_fetched_year => 0 proto_binary_fetched_time => 0 proto_binary_fetched_datetime => 0 proto_binary_fetched_timestamp => 0 proto_binary_fetched_string => 0 proto_binary_fetched_json => 0 proto_binary_fetched_blob => 0 proto_binary_fetched_enum => 0 proto_binary_fetched_set => 0 proto_binary_fetched_geometry => 0 proto_binary_fetched_other => 0 init_command_executed_count => 0 init_command_failed_count => 0 com_quit => 0 com_init_db => 0 com_query => 0 com_field_list => 0 com_create_db => 0 com_drop_db => 0 com_refresh => 0 com_shutdown => 0 com_statistics => 0 com_process_info => 0 com_connect => 0 com_process_kill => 0 com_debug => 0 com_ping => 0 com_time => 0 com_delayed_insert => 0 com_change_user => 0 com_binlog_dump => 0 com_table_dump => 0 com_connect_out => 0 com_register_slave => 0 com_stmt_prepare => 0 com_stmt_execute => 0 com_stmt_send_long_data => 0 com_stmt_close => 0 com_stmt_reset => 0 com_stmt_set_option => 0 com_stmt_fetch => 0 com_deamon => 0 bytes_received_real_data_normal => 0 bytes_received_real_data_ps => 0 openssl OpenSSL support => enabled OpenSSL Library Version => OpenSSL 1.0.1u 22 Sep 2016 OpenSSL Header Version => OpenSSL 1.0.1u 22 Sep 2016 Openssl default config => /etc/ssl/openssl.cnf Directive => Local Value => Master Value openssl.cafile => no value => no value openssl.capath => no value => no value pcre PCRE (Perl Compatible Regular Expressions) Support => enabled PCRE Library Version => 8.38 2015-11-23 PCRE JIT Support => enabled Directive => Local Value => Master Value pcre.backtrack_limit => 1000000 => 1000000 pcre.jit => 1 => 1 pcre.recursion_limit => 100000 => 100000 PDO PDO support => enabled PDO drivers => sqlite, mysql pdo_mysql PDO Driver for MySQL => enabled Client API version => mysqlnd 5.0.12-dev - 20150407 - $Id: b396954eeb2d1d9ed7902b8bae237b287f21ad9e $ Directive => Local Value => Master Value pdo_mysql.default_socket => /var/run/mysqld/mysqld-5.6.sock => /var/run/mysqld/mysqld-5.6.sock pdo_sqlite PDO Driver for SQLite 3.x => enabled SQLite Library => 3.18.0 Phar Phar: PHP Archive support => enabled Phar EXT version => 2.0.2 Phar API version => 1.1.1 SVN revision => $Id: 65ebce0f0856fc5a90a62d32dd0bb5c00627706f $ Phar-based phar archives => enabled Tar-based phar archives => enabled ZIP-based phar archives => enabled gzip compression => enabled bzip2 compression => enabled OpenSSL support => enabled Phar based on pear/PHP_Archive, original concept by Davey Shafik. Phar fully realized by Gregory Beaver and Marcus Boerger. Portions of tar implementation Copyright (c) 2003-2009 Tim Kientzle. Directive => Local Value => Master Value phar.cache_list => no value => no value phar.readonly => On => On phar.require_hash => On => On posix Revision => $Id: f8fe406ea36fdfc387faa50643c68b6889bd00c6 $ Reflection Reflection => enabled Version => $Id: 19975d29bcd8ee1ae7c40540de039ba5601f4b1f $ session Session Support => enabled Registered save handlers => files user Registered serializer handlers => php_serialize php php_binary Directive => Local Value => Master Value session.auto_start => Off => Off session.cache_expire => 180 => 180 session.cache_limiter => nocache => nocache session.cookie_domain => no value => no value session.cookie_httponly => no value => no value session.cookie_lifetime => 0 => 0 session.cookie_path => / => / session.cookie_secure => 0 => 0 session.gc_divisor => 1000 => 1000 session.gc_maxlifetime => 1440 => 1440 session.gc_probability => 1 => 1 session.lazy_write => On => On session.name => PHPSESSID => PHPSESSID session.referer_check => no value => no value session.save_handler => files => files session.save_path => /tmp/ => /tmp/ session.serialize_handler => php => php session.sid_bits_per_character => 5 => 5 session.sid_length => 40 => 40 session.upload_progress.cleanup => On => On session.upload_progress.enabled => On => On session.upload_progress.freq => 1% => 1% session.upload_progress.min_freq => 1 => 1 session.upload_progress.name => PHP_SESSION_UPLOAD_PROGRESS => PHP_SESSION_UPLOAD_PROGRESS session.upload_progress.prefix => upload_progress_ => upload_progress_ session.use_cookies => 1 => 1 session.use_only_cookies => 1 => 1 session.use_strict_mode => 1 => 1 session.use_trans_sid => 0 => 0 SimpleXML Simplexml support => enabled Revision => $Id: bbe47d7ceb76cd3200c41ee57bd718abc564e82d $ Schema support => enabled SPL SPL support => enabled Interfaces => OuterIterator, RecursiveIterator, SeekableIterator, SplObserver, SplSubject Classes => AppendIterator, ArrayIterator, ArrayObject, BadFunctionCallException, BadMethodCallException, CachingIterator, CallbackFilterIterator, DirectoryIterator, DomainException, EmptyIterator, FilesystemIterator, FilterIterator, GlobIterator, InfiniteIterator, InvalidArgumentException, IteratorIterator, LengthException, LimitIterator, LogicException, MultipleIterator, NoRewindIterator, OutOfBoundsException, OutOfRangeException, OverflowException, ParentIterator, RangeException, RecursiveArrayIterator, RecursiveCachingIterator, RecursiveCallbackFilterIterator, RecursiveDirectoryIterator, RecursiveFilterIterator, RecursiveIteratorIterator, RecursiveRegexIterator, RecursiveTreeIterator, RegexIterator, RuntimeException, SplDoublyLinkedList, SplFileInfo, SplFileObject, SplFixedArray, SplHeap, SplMinHeap, SplMaxHeap, SplObjectStorage, SplPriorityQueue, SplQueue, SplStack, SplTempFileObject, UnderflowException, UnexpectedValueException sqlite3 SQLite3 support => enabled SQLite3 module version => 0.7-dev SQLite Library => 3.18.0 Directive => Local Value => Master Value sqlite3.extension_dir => no value => no value standard Dynamic Library Support => enabled Path to sendmail => /usr/sbin/sendmail -t -i Directive => Local Value => Master Value assert.active => 1 => 1 assert.bail => 0 => 0 assert.callback => no value => no value assert.exception => 0 => 0 assert.quiet_eval => 0 => 0 assert.warning => 1 => 1 auto_detect_line_endings => 0 => 0 default_socket_timeout => 60 => 60 from => no value => no value session.trans_sid_hosts => no value => no value session.trans_sid_tags => a=href,area=href,frame=src,form= => a=href,area=href,frame=src,form= url_rewriter.hosts => no value => no value url_rewriter.tags => form= => form= user_agent => no value => no value tokenizer Tokenizer Support => enabled xml XML Support => active XML Namespace Support => active libxml2 Version => 2.9.4 xmlreader XMLReader => enabled xmlwriter XMLWriter => enabled zip Zip => enabled Zip version => 1.14.0 Libzip version => 1.1.2 zlib ZLib Support => enabled Stream Wrapper => compress.zlib:// Stream Filter => zlib.inflate, zlib.deflate Compiled Version => 1.2.6 Linked Version => 1.2.6 Directive => Local Value => Master Value zlib.output_compression => Off => Off zlib.output_compression_level => -1 => -1 zlib.output_handler => no value => no value Additional Modules Module Name Environment Variable => Value CPLUS_INCLUDE_PATH => /usr/lib/qt/include MANPATH => /usr/local/man:/usr/man HOSTNAME => pdc.local TEST_PHP_SRCDIR => /tmp/php-7.2.0alpha1 SHELL => /bin/bash TERM => cygwin MAKEFLAGS => SSH_CLIENT => deleted TEST_PHPDBG_EXECUTABLE => /tmp/php-7.2.0alpha1/sapi/phpdbg/phpdbg SSH_TTY => deleted USER => xxx LS_COLORS => no=00:fi=00:di=01;34:ln=01;36:pi=40;33:so=01;35:do=01;35:bd=40;33;01:cd=40;33;01:or=40;31;01:su=37;41:sg=30;43:ca=30;41:tw=30;42:ow=34;42:st=37;44:ex=01;32:*.bat=01;32:*.BAT=01;32:*.btm=01;32:*.BTM=01;32:*.cmd=01;32:*.CMD=01;32:*.com=01;32:*.COM=01;32:*.dll=01;32:*.DLL=01;32:*.exe=01;32:*.EXE=01;32:*.7z=01;31:*.ace=01;31:*.ACE=01;31:*.arj=01;31:*.bz2=01;31:*.cpio=01;31:*.deb=01;31:*.dz=01;31:*.gz=01;31:*.jar=01;31:*.lzh=01;31:*.lzma=01;31:*.rar=01;31:*.RAR=01;31:*.rpm=01;31:*.rz=01;31:*.tar=01;31:*.taz=01;31:*.tb2=01;31:*.tbz2=01;31:*.tbz=01;31:*.tgz=01;31:*.tlz=01;31:*.trz=01;31:*.txz=01;31:*.tz=01;31:*.tz2=01;31:*.xz=01;31:*.z=01;31:*.Z=01;31:*.zip=01;31:*.ZIP=01;31:*.zoo=01;31:*.aac=01;35:*.AAC=01;35:*.anx=01;35:*.asf=01;35:*.ASF=01;35:*.au=01;35:*.axa=01;35:*.axv=01;35:*.avi=01;35:*.AVI=01;35:*.bmp=01;35:*.BMP=01;35:*.divx=01;35:*.DIVX=01;35:*.flac=01;35:*.FLAC=01;35:*.gif=01;35:*.GIF=01;35:*.jpg=01;35:*.JPG=01;35:*.jpeg=01;35:*.JPEG=01;35:*.m2a=01;35:*.M2A=01;35:*.m2v=01;35:*.M2V=01;35:*.m4a=01;35:*.M4A=01;35:*.m4p=01;35:*.M4P=01;35:*.m4v=01;35:*.M4V=01;35:*.mid=01;35:*.midi=01;35:*.mka=01;35:*.mkv=01;35:*.MKV=01;35:*.mov=01;35:*.MOV=01;35:*.mp3=01;35:*.MP3=01;35:*.mp4=01;35:*.MP4=01;35:*.mp4v=01;35:*.mpc=01;35:*.MPC=01;35:*.mpeg=01;35:*.MPEG=01;35:*.mpg=01;35:*.MPG=01;35:*.nuv=01;35:*.oga=01;35:*.ogv=01;35:*.ogx=01;35:*.ogg=01;35:*.OGG=01;35:*.pbm=01;35:*.pgm=01;35:*.png=01;35:*.PNG=01;35:*.ppm=01;35:*.qt=01;35:*.ra=01;35:*.RA=01;35:*.ram=01;35:*.RAM=01;35:*.rm=01;35:*.RM=01;35:*.spx=01;35:*.svg=01;35:*.svgz=01;35:*.tga=01;35:*.TGA=01;35:*.tif=01;35:*.TIF=01;35:*.tiff=01;35:*.TIFF=01;35:*.vob=01;35:*.VOB=01;35:*.wav=01;35:*.WAV=01;35:*.wma=01;35:*.WMA=01;35:*.wmv=01;35:*.WMV=01;35:*.xbm=01;35:*.xcf=01;35:*.xpm=01;35:*.xspf=01;35:*.xwd=01;35:*.XWD=01;35:*.xvid=01;35: GREP_COLORS => fn=01;35:ln=01;32 GDK_USE_XFT => 1 SSH_AUTH_SOCK => deleted MAKELEVEL => 1 MFLAGS => T1LIB_CONFIG => /usr/share/t1lib/t1lib.config MINICOM => -c on PATH => /mnt/home/xxx/bin:/usr/local/bin:/usr/bin:/bin:/usr/games:/usr/lib/qt/bin:. MAIL => /var/mail/xxx _ => /tmp/php-7.2.0alpha1/sapi/cli/php LC_COLLATE => C PWD => /tmp/php-7.2.0alpha1 INPUTRC => /etc/inputrc EDITOR => vim LANG => it_IT.utf8 TEST_PHP_EXECUTABLE => /tmp/php-7.2.0alpha1/sapi/cli/php QT4DIR => /usr/lib/qt HOME => /mnt/home/xxx SHLVL => 3 GREP_OPTIONS => --color=auto --exclude-dir=.cvs --exclude-dir=.git --exclude-dir=.hg --exclude-dir=.svn --exclude-dir=.work LS_OPTIONS => -F -b -T 0 --color=auto LOGNAME => xxx LESS => -M SSH_CONNECTION => deleted LESSOPEN => |lesspipe.sh %s PKG_CONFIG_PATH => /usr/local/lib/pkgconfig:/usr/lib/pkgconfig CC => cc G_BROKEN_FILENAMES => 1 PHP Variables Variable => Value $_SERVER['CPLUS_INCLUDE_PATH'] => /usr/lib/qt/include $_SERVER['MANPATH'] => /usr/local/man:/usr/man $_SERVER['HOSTNAME'] => pdc.local $_SERVER['TEST_PHP_SRCDIR'] => /tmp/php-7.2.0alpha1 $_SERVER['SHELL'] => /bin/bash $_SERVER['TERM'] => cygwin $_SERVER['MAKEFLAGS'] => $_SERVER['SSH_CLIENT'] => deleted $_SERVER['TEST_PHPDBG_EXECUTABLE'] => /tmp/php-7.2.0alpha1/sapi/phpdbg/phpdbg $_SERVER['SSH_TTY'] => deleted $_SERVER['USER'] => xxx $_SERVER['LS_COLORS'] => no=00:fi=00:di=01;34:ln=01;36:pi=40;33:so=01;35:do=01;35:bd=40;33;01:cd=40;33;01:or=40;31;01:su=37;41:sg=30;43:ca=30;41:tw=30;42:ow=34;42:st=37;44:ex=01;32:*.bat=01;32:*.BAT=01;32:*.btm=01;32:*.BTM=01;32:*.cmd=01;32:*.CMD=01;32:*.com=01;32:*.COM=01;32:*.dll=01;32:*.DLL=01;32:*.exe=01;32:*.EXE=01;32:*.7z=01;31:*.ace=01;31:*.ACE=01;31:*.arj=01;31:*.bz2=01;31:*.cpio=01;31:*.deb=01;31:*.dz=01;31:*.gz=01;31:*.jar=01;31:*.lzh=01;31:*.lzma=01;31:*.rar=01;31:*.RAR=01;31:*.rpm=01;31:*.rz=01;31:*.tar=01;31:*.taz=01;31:*.tb2=01;31:*.tbz2=01;31:*.tbz=01;31:*.tgz=01;31:*.tlz=01;31:*.trz=01;31:*.txz=01;31:*.tz=01;31:*.tz2=01;31:*.xz=01;31:*.z=01;31:*.Z=01;31:*.zip=01;31:*.ZIP=01;31:*.zoo=01;31:*.aac=01;35:*.AAC=01;35:*.anx=01;35:*.asf=01;35:*.ASF=01;35:*.au=01;35:*.axa=01;35:*.axv=01;35:*.avi=01;35:*.AVI=01;35:*.bmp=01;35:*.BMP=01;35:*.divx=01;35:*.DIVX=01;35:*.flac=01;35:*.FLAC=01;35:*.gif=01;35:*.GIF=01;35:*.jpg=01;35:*.JPG=01;35:*.jpeg=01;35:*.JPEG=01;35:*.m2a=01;35:*.M2A=01;35:*.m2v=01;35:*.M2V=01;35:*.m4a=01;35:*.M4A=01;35:*.m4p=01;35:*.M4P=01;35:*.m4v=01;35:*.M4V=01;35:*.mid=01;35:*.midi=01;35:*.mka=01;35:*.mkv=01;35:*.MKV=01;35:*.mov=01;35:*.MOV=01;35:*.mp3=01;35:*.MP3=01;35:*.mp4=01;35:*.MP4=01;35:*.mp4v=01;35:*.mpc=01;35:*.MPC=01;35:*.mpeg=01;35:*.MPEG=01;35:*.mpg=01;35:*.MPG=01;35:*.nuv=01;35:*.oga=01;35:*.ogv=01;35:*.ogx=01;35:*.ogg=01;35:*.OGG=01;35:*.pbm=01;35:*.pgm=01;35:*.png=01;35:*.PNG=01;35:*.ppm=01;35:*.qt=01;35:*.ra=01;35:*.RA=01;35:*.ram=01;35:*.RAM=01;35:*.rm=01;35:*.RM=01;35:*.spx=01;35:*.svg=01;35:*.svgz=01;35:*.tga=01;35:*.TGA=01;35:*.tif=01;35:*.TIF=01;35:*.tiff=01;35:*.TIFF=01;35:*.vob=01;35:*.VOB=01;35:*.wav=01;35:*.WAV=01;35:*.wma=01;35:*.WMA=01;35:*.wmv=01;35:*.WMV=01;35:*.xbm=01;35:*.xcf=01;35:*.xpm=01;35:*.xspf=01;35:*.xwd=01;35:*.XWD=01;35:*.xvid=01;35: $_SERVER['GREP_COLORS'] => fn=01;35:ln=01;32 $_SERVER['GDK_USE_XFT'] => 1 $_SERVER['SSH_AUTH_SOCK'] => deleted $_SERVER['MAKELEVEL'] => 1 $_SERVER['MFLAGS'] => $_SERVER['T1LIB_CONFIG'] => /usr/share/t1lib/t1lib.config $_SERVER['MINICOM'] => -c on $_SERVER['PATH'] => /mnt/home/xxx/bin:/usr/local/bin:/usr/bin:/bin:/usr/games:/usr/lib/qt/bin:. $_SERVER['MAIL'] => /var/mail/xxx $_SERVER['_'] => /tmp/php-7.2.0alpha1/sapi/cli/php $_SERVER['LC_COLLATE'] => C $_SERVER['PWD'] => /tmp/php-7.2.0alpha1 $_SERVER['INPUTRC'] => /etc/inputrc $_SERVER['EDITOR'] => vim $_SERVER['LANG'] => it_IT.utf8 $_SERVER['TEST_PHP_EXECUTABLE'] => /tmp/php-7.2.0alpha1/sapi/cli/php $_SERVER['QT4DIR'] => /usr/lib/qt $_SERVER['HOME'] => /mnt/home/xxx $_SERVER['SHLVL'] => 3 $_SERVER['GREP_OPTIONS'] => --color=auto --exclude-dir=.cvs --exclude-dir=.git --exclude-dir=.hg --exclude-dir=.svn --exclude-dir=.work $_SERVER['LS_OPTIONS'] => -F -b -T 0 --color=auto $_SERVER['LOGNAME'] => xxx $_SERVER['LESS'] => -M $_SERVER['SSH_CONNECTION'] => deleted $_SERVER['LESSOPEN'] => |lesspipe.sh %s $_SERVER['PKG_CONFIG_PATH'] => /usr/local/lib/pkgconfig:/usr/lib/pkgconfig $_SERVER['CC'] => cc $_SERVER['G_BROKEN_FILENAMES'] => 1 $_SERVER['PHP_SELF'] => $_SERVER['SCRIPT_NAME'] => $_SERVER['SCRIPT_FILENAME'] => $_SERVER['PATH_TRANSLATED'] => $_SERVER['DOCUMENT_ROOT'] => $_SERVER['REQUEST_TIME_FLOAT'] => 1496933334.0958 $_SERVER['REQUEST_TIME'] => 1496933334 $_SERVER['argv'] => Array ( ) $_SERVER['argc'] => 0 PHP License This program is free software; you can redistribute it and/or modify it under the terms of the PHP License as published by the PHP Group and included in the distribution in the file: LICENSE This program is distributed in the hope that it will be useful, but WITHOUT ANY WARRANTY; without even the implied warranty of MERCHANTABILITY or FITNESS FOR A PARTICULAR PURPOSE. If you did not receive a copy of the PHP license, or have any questions about PHP licensing, please contact license@php.net.
« previous php.qa.reports (#33969) next »