Error report generated in make test (php-7.1.6)
| From: | Allan Kamau | Date: | Wed, 14 Jun 2017 15:34:03 +0000 |
| Subject: | Error report generated in make test (php-7.1.6) | ||
| Groups: | php.qa.reports | ||
| Request: | Send a blank email to php-qa-reports+get-33970@lists.php.net to get a copy of this message | ||
===================================================================== EXPECTED FAILED TEST SUMMARY --------------------------------------------------------------------- Test open_basedir configuration [tests/security/open_basedir_linkinfo.phpt] XFAIL REASON: BUG: open_basedir cannot delete symlink to prohibited file. See also bugs 48111 and 52176. Inconsistencies when accessing protected members [Zend/tests/access_modifiers_008.phpt] XFAIL REASON: Discussion: http://marc.info/?l=php-internals&m=120221184420957&w=2 Inconsistencies when accessing protected members - 2 [Zend/tests/access_modifiers_009.phpt] XFAIL REASON: Discussion: http://marc.info/?l=php-internals&m=120221184420957&w=2 Bug #48770 (call_user_func_array() fails to call parent from inheriting class) [Zend/tests/bug48770.phpt] XFAIL REASON: See Bug #48770 Bug #48770 (call_user_func_array() fails to call parent from inheriting class) [Zend/tests/bug48770_2.phpt] XFAIL REASON: See Bug #48770 Bug #48770 (call_user_func_array() fails to call parent from inheriting class) [Zend/tests/bug48770_3.phpt] XFAIL REASON: See Bug #48770 Initial value of static var in method depends on the include time of the class definition [Zend/tests/method_static_var.phpt] XFAIL REASON: Maybe not a bug DateTime::add() -- fall type2 type3 [ext/date/tests/DateTime_add-fall-type2-type3.phpt] XFAIL REASON: Various bugs exist DateTime::add() -- fall type3 type2 [ext/date/tests/DateTime_add-fall-type3-type2.phpt] XFAIL REASON: Various bugs exist DateTime::add() -- fall type3 type3 [ext/date/tests/DateTime_add-fall-type3-type3.phpt] XFAIL REASON: Various bugs exist DateTime::add() -- spring type2 type3 [ext/date/tests/DateTime_add-spring-type2-type3.phpt] XFAIL REASON: Various bugs exist DateTime::add() -- spring type3 type2 [ext/date/tests/DateTime_add-spring-type3-type2.phpt] XFAIL REASON: Various bugs exist DateTime::add() -- spring type3 type3 [ext/date/tests/DateTime_add-spring-type3-type3.phpt] XFAIL REASON: Various bugs exist DateTime::diff() -- fall type2 type3 [ext/date/tests/DateTime_diff-fall-type2-type3.phpt] XFAIL REASON: Various bugs exist DateTime::diff() -- fall type3 type2 [ext/date/tests/DateTime_diff-fall-type3-type2.phpt] XFAIL REASON: Various bugs exist DateTime::diff() -- fall type3 type3 [ext/date/tests/DateTime_diff-fall-type3-type3.phpt] XFAIL REASON: Various bugs exist DateTime::diff() -- spring type2 type3 [ext/date/tests/DateTime_diff-spring-type2-type3.phpt] XFAIL REASON: Various bugs exist DateTime::diff() -- spring type3 type2 [ext/date/tests/DateTime_diff-spring-type3-type2.phpt] XFAIL REASON: Various bugs exist DateTime::diff() -- spring type3 type3 [ext/date/tests/DateTime_diff-spring-type3-type3.phpt] XFAIL REASON: Various bugs exist DateTime::sub() -- fall type2 type3 [ext/date/tests/DateTime_sub-fall-type2-type3.phpt] XFAIL REASON: Various bugs exist DateTime::sub() -- fall type3 type2 [ext/date/tests/DateTime_sub-fall-type3-type2.phpt] XFAIL REASON: Various bugs exist DateTime::sub() -- fall type3 type3 [ext/date/tests/DateTime_sub-fall-type3-type3.phpt] XFAIL REASON: Various bugs exist DateTime::sub() -- spring type2 type3 [ext/date/tests/DateTime_sub-spring-type2-type3.phpt] XFAIL REASON: Various bugs exist DateTime::sub() -- spring type3 type2 [ext/date/tests/DateTime_sub-spring-type3-type2.phpt] XFAIL REASON: Various bugs exist DateTime::sub() -- spring type3 type3 [ext/date/tests/DateTime_sub-spring-type3-type3.phpt] XFAIL REASON: Various bugs exist Bug #55407 (Impossible to prototype DateTime::createFromFormat) [ext/date/tests/bug55407.phpt] XFAIL REASON: Bug #55407 RFC: DateTime and Daylight Saving Time Transitions (zone type 3, bd2) [ext/date/tests/rfc-datetime_and_daylight_saving_time-type3-bd2.phpt] XFAIL REASON: Still not quite right RFC: DateTime and Daylight Saving Time Transitions (zone type 3, fs) [ext/date/tests/rfc-datetime_and_daylight_saving_time-type3-fs.phpt] XFAIL REASON: Still not quite right Bug #42718 (unsafe_raw filter not applied when configured as default filter) [ext/filter/tests/bug42718.phpt] XFAIL REASON: FILTER_UNSAFE_RAW not applied when configured as default filter, even with flags Bug #67296 (filter_input doesn't validate variables) [ext/filter/tests/bug49184.phpt] XFAIL REASON: See Bug #49184 Bug #67167: filter_var(null,FILTER_VALIDATE_BOOLEAN,FILTER_NULL_ON_FAILURE) returns null [ext/filter/tests/bug67167.02.phpt] XFAIL REASON: Requires php_zval_filter to not use convert_to_string for all filters. Phar: bug #69958: Segfault in Phar::convertToData on invalid file [ext/phar/tests/bug69958.phpt] XFAIL REASON: Still has memory leaks, see https://bugs.php.net/bug.php?id=70005 updateTimestamp never called when session data is empty [ext/session/tests/bug71162.phpt] XFAIL REASON: Current session module is designed to write empty session always. In addition, current session module only supports SessionHandlerInterface only from PHP 7.0. Bug #70219 Use after free vulnerability in session deserializer [ext/standard/tests/serialize/bug70219.phpt] XFAIL REASON: Unfinished merge, needs fix. Bug #70470 (Built-in server truncates headers spanning over TCP packets) [sapi/cli/tests/bug70470.phpt] XFAIL REASON: bug is not fixed yet ===================================================================== ===================================================================== FAILED TEST SUMMARY --------------------------------------------------------------------- Test disk_free_space and its alias diskfreespace() functions : basic functionality [ext/standard/tests/file/disk_free_space_basic.phpt] file_get_contents() test using offset parameter out of range [ext/standard/tests/file/file_get_contents_error001.phpt] Test lstat() and stat() functions: usage variations - writing data into file [ext/standard/tests/file/lstat_stat_variation7.phpt] Bug #60120 proc_open hangs with stdin/out with 2048+ bytes [ext/standard/tests/streams/proc_open_bug60120.phpt] Fundamental breakpoints functionality [sapi/phpdbg/tests/breakpoints_001.phpt] Preserve breakpoints on restart [sapi/phpdbg/tests/breakpoints_002.phpt] Test deleting breakpoints [sapi/phpdbg/tests/breakpoints_003.phpt] Test opcode breakpoints [sapi/phpdbg/tests/breakpoints_004.phpt] Test breakpoint into function context [sapi/phpdbg/tests/breakpoints_005.phpt] Basic function breakpoints [sapi/phpdbg/tests/breakpoints_006.phpt] Test namespaced and non-lowercase breakpoint names [sapi/phpdbg/tests/breakpoints_008.phpt] Bug #73704 (phpdbg shows the wrong line in files with shebang) [sapi/phpdbg/tests/bug73704.phpt] Cleaning must preserve breakpoints [sapi/phpdbg/tests/clean_001.phpt] Test clearing breakpoints [sapi/phpdbg/tests/clear_001.phpt] Properly handle exceptions going to be uncaught [sapi/phpdbg/tests/exceptions_001.phpt] Test exceptions in eval during exception [sapi/phpdbg/tests/exceptions_002.phpt] Ensure proper saving of EX(opline) [sapi/phpdbg/tests/generator_run.phpt] include_once must include only once [sapi/phpdbg/tests/include_once.phpt] Test basic info functionality [sapi/phpdbg/tests/info_001.phpt] A script with die() must end "normally" [sapi/phpdbg/tests/normal_exit.phpt] Test phpdbg_break_next() function [sapi/phpdbg/tests/phpdbg_break_next.phpt] Getting executable lines from custom wrappers [sapi/phpdbg/tests/phpdbg_get_executable_stream_wrapper.phpt] Test phpdbg_*_oplog() functions [sapi/phpdbg/tests/phpdbg_oplog_001.phpt] phpdbg_end_oplog() alone must not crash [sapi/phpdbg/tests/phpdbg_oplog_002.phpt] Test argv passing [sapi/phpdbg/tests/run_001.phpt] Stdin and escaped args being passed to run command [sapi/phpdbg/tests/run_002.phpt] set_exception_handler() in phpdbg [sapi/phpdbg/tests/set_exception_handler.phpt] Test stdin input with breakpoints [sapi/phpdbg/tests/stdin_001.phpt] Test simple recursive watchpoint [sapi/phpdbg/tests/watch_001.phpt] Test simple array watchpoint with replace [sapi/phpdbg/tests/watch_002.phpt] Test simple watchpoint with replace [sapi/phpdbg/tests/watch_003.phpt] Test detection of inline string manipulations on zval watch [sapi/phpdbg/tests/watch_004.phpt] Test proper watch comparisons when having multiple levels of indirection from a zval to its value [sapi/phpdbg/tests/watch_005.phpt] Test multiple watch elements pointing to the same watchpoint [sapi/phpdbg/tests/watch_006.phpt] ===================================================================== ===================================================================== WARNED TEST SUMMARY --------------------------------------------------------------------- FPM: Test status page [sapi/fpm/tests/010.phpt] (warn: XFAIL section but test passes) FPM: Test various messages on start, from master and childs [sapi/fpm/tests/015.phpt] (warn: XFAIL section but test passes) ===================================================================== ===================================================================== TEST RESULT SUMMARY --------------------------------------------------------------------- Exts skipped : 36 Exts tested : 38 --------------------------------------------------------------------- Number of tests : 15448 11964 Tests skipped : 3484 ( 22.6%) -------- Tests warned : 2 ( 0.0%) ( 0.0%) Tests failed : 34 ( 0.2%) ( 0.3%) Expected fail : 35 ( 0.2%) ( 0.3%) Tests passed : 11893 ( 77.0%) ( 99.4%) --------------------------------------------------------------------- Time taken : 716 seconds ===================================================================== ===================================================================== EXPECTED FAILED TEST SUMMARY --------------------------------------------------------------------- Test open_basedir configuration [tests/security/open_basedir_linkinfo.phpt] XFAIL REASON: BUG: open_basedir cannot delete symlink to prohibited file. See also bugs 48111 and 52176. Inconsistencies when accessing protected members [Zend/tests/access_modifiers_008.phpt] XFAIL REASON: Discussion: http://marc.info/?l=php-internals&m=120221184420957&w=2 Inconsistencies when accessing protected members - 2 [Zend/tests/access_modifiers_009.phpt] XFAIL REASON: Discussion: http://marc.info/?l=php-internals&m=120221184420957&w=2 Bug #48770 (call_user_func_array() fails to call parent from inheriting class) [Zend/tests/bug48770.phpt] XFAIL REASON: See Bug #48770 Bug #48770 (call_user_func_array() fails to call parent from inheriting class) [Zend/tests/bug48770_2.phpt] XFAIL REASON: See Bug #48770 Bug #48770 (call_user_func_array() fails to call parent from inheriting class) [Zend/tests/bug48770_3.phpt] XFAIL REASON: See Bug #48770 Initial value of static var in method depends on the include time of the class definition [Zend/tests/method_static_var.phpt] XFAIL REASON: Maybe not a bug DateTime::add() -- fall type2 type3 [ext/date/tests/DateTime_add-fall-type2-type3.phpt] XFAIL REASON: Various bugs exist DateTime::add() -- fall type3 type2 [ext/date/tests/DateTime_add-fall-type3-type2.phpt] XFAIL REASON: Various bugs exist DateTime::add() -- fall type3 type3 [ext/date/tests/DateTime_add-fall-type3-type3.phpt] XFAIL REASON: Various bugs exist DateTime::add() -- spring type2 type3 [ext/date/tests/DateTime_add-spring-type2-type3.phpt] XFAIL REASON: Various bugs exist DateTime::add() -- spring type3 type2 [ext/date/tests/DateTime_add-spring-type3-type2.phpt] XFAIL REASON: Various bugs exist DateTime::add() -- spring type3 type3 [ext/date/tests/DateTime_add-spring-type3-type3.phpt] XFAIL REASON: Various bugs exist DateTime::diff() -- fall type2 type3 [ext/date/tests/DateTime_diff-fall-type2-type3.phpt] XFAIL REASON: Various bugs exist DateTime::diff() -- fall type3 type2 [ext/date/tests/DateTime_diff-fall-type3-type2.phpt] XFAIL REASON: Various bugs exist DateTime::diff() -- fall type3 type3 [ext/date/tests/DateTime_diff-fall-type3-type3.phpt] XFAIL REASON: Various bugs exist DateTime::diff() -- spring type2 type3 [ext/date/tests/DateTime_diff-spring-type2-type3.phpt] XFAIL REASON: Various bugs exist DateTime::diff() -- spring type3 type2 [ext/date/tests/DateTime_diff-spring-type3-type2.phpt] XFAIL REASON: Various bugs exist DateTime::diff() -- spring type3 type3 [ext/date/tests/DateTime_diff-spring-type3-type3.phpt] XFAIL REASON: Various bugs exist DateTime::sub() -- fall type2 type3 [ext/date/tests/DateTime_sub-fall-type2-type3.phpt] XFAIL REASON: Various bugs exist DateTime::sub() -- fall type3 type2 [ext/date/tests/DateTime_sub-fall-type3-type2.phpt] XFAIL REASON: Various bugs exist DateTime::sub() -- fall type3 type3 [ext/date/tests/DateTime_sub-fall-type3-type3.phpt] XFAIL REASON: Various bugs exist DateTime::sub() -- spring type2 type3 [ext/date/tests/DateTime_sub-spring-type2-type3.phpt] XFAIL REASON: Various bugs exist DateTime::sub() -- spring type3 type2 [ext/date/tests/DateTime_sub-spring-type3-type2.phpt] XFAIL REASON: Various bugs exist DateTime::sub() -- spring type3 type3 [ext/date/tests/DateTime_sub-spring-type3-type3.phpt] XFAIL REASON: Various bugs exist Bug #55407 (Impossible to prototype DateTime::createFromFormat) [ext/date/tests/bug55407.phpt] XFAIL REASON: Bug #55407 RFC: DateTime and Daylight Saving Time Transitions (zone type 3, bd2) [ext/date/tests/rfc-datetime_and_daylight_saving_time-type3-bd2.phpt] XFAIL REASON: Still not quite right RFC: DateTime and Daylight Saving Time Transitions (zone type 3, fs) [ext/date/tests/rfc-datetime_and_daylight_saving_time-type3-fs.phpt] XFAIL REASON: Still not quite right Bug #42718 (unsafe_raw filter not applied when configured as default filter) [ext/filter/tests/bug42718.phpt] XFAIL REASON: FILTER_UNSAFE_RAW not applied when configured as default filter, even with flags Bug #67296 (filter_input doesn't validate variables) [ext/filter/tests/bug49184.phpt] XFAIL REASON: See Bug #49184 Bug #67167: filter_var(null,FILTER_VALIDATE_BOOLEAN,FILTER_NULL_ON_FAILURE) returns null [ext/filter/tests/bug67167.02.phpt] XFAIL REASON: Requires php_zval_filter to not use convert_to_string for all filters. Phar: bug #69958: Segfault in Phar::convertToData on invalid file [ext/phar/tests/bug69958.phpt] XFAIL REASON: Still has memory leaks, see https://bugs.php.net/bug.php?id=70005 updateTimestamp never called when session data is empty [ext/session/tests/bug71162.phpt] XFAIL REASON: Current session module is designed to write empty session always. In addition, current session module only supports SessionHandlerInterface only from PHP 7.0. Bug #70219 Use after free vulnerability in session deserializer [ext/standard/tests/serialize/bug70219.phpt] XFAIL REASON: Unfinished merge, needs fix. Bug #70470 (Built-in server truncates headers spanning over TCP packets) [sapi/cli/tests/bug70470.phpt] XFAIL REASON: bug is not fixed yet ===================================================================== ===================================================================== FAILED TEST SUMMARY --------------------------------------------------------------------- Test disk_free_space and its alias diskfreespace() functions : basic functionality [ext/standard/tests/file/disk_free_space_basic.phpt] file_get_contents() test using offset parameter out of range [ext/standard/tests/file/file_get_contents_error001.phpt] Test lstat() and stat() functions: usage variations - writing data into file [ext/standard/tests/file/lstat_stat_variation7.phpt] Bug #60120 proc_open hangs with stdin/out with 2048+ bytes [ext/standard/tests/streams/proc_open_bug60120.phpt] Fundamental breakpoints functionality [sapi/phpdbg/tests/breakpoints_001.phpt] Preserve breakpoints on restart [sapi/phpdbg/tests/breakpoints_002.phpt] Test deleting breakpoints [sapi/phpdbg/tests/breakpoints_003.phpt] Test opcode breakpoints [sapi/phpdbg/tests/breakpoints_004.phpt] Test breakpoint into function context [sapi/phpdbg/tests/breakpoints_005.phpt] Basic function breakpoints [sapi/phpdbg/tests/breakpoints_006.phpt] Test namespaced and non-lowercase breakpoint names [sapi/phpdbg/tests/breakpoints_008.phpt] Bug #73704 (phpdbg shows the wrong line in files with shebang) [sapi/phpdbg/tests/bug73704.phpt] Cleaning must preserve breakpoints [sapi/phpdbg/tests/clean_001.phpt] Test clearing breakpoints [sapi/phpdbg/tests/clear_001.phpt] Properly handle exceptions going to be uncaught [sapi/phpdbg/tests/exceptions_001.phpt] Test exceptions in eval during exception [sapi/phpdbg/tests/exceptions_002.phpt] Ensure proper saving of EX(opline) [sapi/phpdbg/tests/generator_run.phpt] include_once must include only once [sapi/phpdbg/tests/include_once.phpt] Test basic info functionality [sapi/phpdbg/tests/info_001.phpt] A script with die() must end "normally" [sapi/phpdbg/tests/normal_exit.phpt] Test phpdbg_break_next() function [sapi/phpdbg/tests/phpdbg_break_next.phpt] Getting executable lines from custom wrappers [sapi/phpdbg/tests/phpdbg_get_executable_stream_wrapper.phpt] Test phpdbg_*_oplog() functions [sapi/phpdbg/tests/phpdbg_oplog_001.phpt] phpdbg_end_oplog() alone must not crash [sapi/phpdbg/tests/phpdbg_oplog_002.phpt] Test argv passing [sapi/phpdbg/tests/run_001.phpt] Stdin and escaped args being passed to run command [sapi/phpdbg/tests/run_002.phpt] set_exception_handler() in phpdbg [sapi/phpdbg/tests/set_exception_handler.phpt] Test stdin input with breakpoints [sapi/phpdbg/tests/stdin_001.phpt] Test simple recursive watchpoint [sapi/phpdbg/tests/watch_001.phpt] Test simple array watchpoint with replace [sapi/phpdbg/tests/watch_002.phpt] Test simple watchpoint with replace [sapi/phpdbg/tests/watch_003.phpt] Test detection of inline string manipulations on zval watch [sapi/phpdbg/tests/watch_004.phpt] Test proper watch comparisons when having multiple levels of indirection from a zval to its value [sapi/phpdbg/tests/watch_005.phpt] Test multiple watch elements pointing to the same watchpoint [sapi/phpdbg/tests/watch_006.phpt] ===================================================================== ===================================================================== WARNED TEST SUMMARY --------------------------------------------------------------------- FPM: Test status page [sapi/fpm/tests/010.phpt] (warn: XFAIL section but test passes) FPM: Test various messages on start, from master and childs [sapi/fpm/tests/015.phpt] (warn: XFAIL section but test passes) ===================================================================== ================================================================================ /local/data/apps/src/php/php-7.1.6/ext/standard/tests/file/disk_free_space_basic.phpt ================================================================================ *** Testing with existing directory *** float(1445178114048) float(1445178114048) *** Testing with newly created directory *** Free Space before writing to a file float(1445178114048) Free Space after writing to a file float(1445178114048) Free Space Value Is Incorrect float(1445178114048) float(1445178114048) *** Testing with Binary Input *** float(1445178114048) --- Done --- ================================================================================ 012+ Free Space Value Is Incorrect 013+ float(1445178114048) 014+ float(1445178114048) 012- Free Space Value Is Correct ================================================================================ ================================================================================ /local/data/apps/src/php/php-7.1.6/ext/standard/tests/file/file_get_contents_error001.phpt ================================================================================ ** ERROR: process timed out ** ================================================================================ 001+ ** ERROR: process timed out ** 001- bool(false) ================================================================================ ================================================================================ /local/data/apps/src/php/php-7.1.6/ext/standard/tests/file/lstat_stat_variation7.phpt ================================================================================ *** Testing stat() on file after data is written in it *** bool(true) bool(true) Error: stat1 is not lesser than stat2 at key value: 12 Error: stat1 is not lesser than stat2 at key value: blocks Dumping stat array 1... array(26) { [0]=> int(41) [1]=> int(61002237) [2]=> int(33204) [3]=> int(1) [4]=> int(1001) [5]=> int(1001) [6]=> int(0) [7]=> int(0) [8]=> int(1497453563) [9]=> int(1497453563) [10]=> int(1497453563) [11]=> int(131072) [12]=> int(1) ["dev"]=> int(41) ["ino"]=> int(61002237) ["mode"]=> int(33204) ["nlink"]=> int(1) ["uid"]=> int(1001) ["gid"]=> int(1001) ["rdev"]=> int(0) ["size"]=> int(0) ["atime"]=> int(1497453563) ["mtime"]=> int(1497453563) ["ctime"]=> int(1497453563) ["blksize"]=> int(131072) ["blocks"]=> int(1) } Dumping stat array 2... array(26) { [0]=> int(41) [1]=> int(61002237) [2]=> int(33204) [3]=> int(1) [4]=> int(1001) [5]=> int(1001) [6]=> int(0) [7]=> int(1441792) [8]=> int(1497453563) [9]=> int(1497453563) [10]=> int(1497453563) [11]=> int(131072) [12]=> int(1) ["dev"]=> int(41) ["ino"]=> int(61002237) ["mode"]=> int(33204) ["nlink"]=> int(1) ["uid"]=> int(1001) ["gid"]=> int(1001) ["rdev"]=> int(0) ["size"]=> int(1441792) ["atime"]=> int(1497453563) ["mtime"]=> int(1497453563) ["ctime"]=> int(1497453563) ["blksize"]=> int(131072) ["blocks"]=> int(1) } bool(false) --- Done --- ================================================================================ 004+ Error: stat1 is not lesser than stat2 at key value: 12 005+ Error: stat1 is not lesser than stat2 at key value: blocks 004- bool(true) 006- --- Done --- 007+ Dumping stat array 1... 008+ array(26) { 009+ [0]=> 010+ int(41) 011+ [1]=> 012+ int(61002237) 013+ [2]=> 014+ int(33204) 015+ [3]=> 016+ int(1) 017+ [4]=> 018+ int(1001) 019+ [5]=> 020+ int(1001) 021+ [6]=> 022+ int(0) 023+ [7]=> 024+ int(0) 025+ [8]=> 026+ int(1497453563) 027+ [9]=> 028+ int(1497453563) 029+ [10]=> 030+ int(1497453563) 031+ [11]=> 032+ int(131072) 033+ [12]=> 034+ int(1) 035+ ["dev"]=> 036+ int(41) 037+ ["ino"]=> 038+ int(61002237) 039+ ["mode"]=> 040+ int(33204) 041+ ["nlink"]=> 042+ int(1) 043+ ["uid"]=> 044+ int(1001) 045+ ["gid"]=> 046+ int(1001) 047+ ["rdev"]=> 048+ int(0) 049+ ["size"]=> 050+ int(0) 051+ ["atime"]=> 052+ int(1497453563) 053+ ["mtime"]=> 054+ int(1497453563) 055+ ["ctime"]=> 056+ int(1497453563) 057+ ["blksize"]=> 058+ int(131072) 059+ ["blocks"]=> 060+ int(1) 061+ } 062+ 063+ Dumping stat array 2... 064+ array(26) { 065+ [0]=> 066+ int(41) 067+ [1]=> 068+ int(61002237) 069+ [2]=> 070+ int(33204) 071+ [3]=> 072+ int(1) 073+ [4]=> 074+ int(1001) 075+ [5]=> 076+ int(1001) 077+ [6]=> 078+ int(0) 079+ [7]=> 080+ int(1441792) 081+ [8]=> 082+ int(1497453563) 083+ [9]=> 084+ int(1497453563) 085+ [10]=> 086+ int(1497453563) 087+ [11]=> 088+ int(131072) 089+ [12]=> 090+ int(1) 091+ ["dev"]=> 092+ int(41) 093+ ["ino"]=> 094+ int(61002237) 095+ ["mode"]=> 096+ int(33204) 097+ ["nlink"]=> 098+ int(1) 099+ ["uid"]=> 100+ int(1001) 101+ ["gid"]=> 102+ int(1001) 103+ ["rdev"]=> 104+ int(0) 105+ ["size"]=> 106+ int(1441792) 107+ ["atime"]=> 108+ int(1497453563) 109+ ["mtime"]=> 110+ int(1497453563) 111+ ["ctime"]=> 112+ int(1497453563) 113+ ["blksize"]=> 114+ int(131072) 115+ ["blocks"]=> 116+ int(1) 117+ } 118+ bool(false) 119+ 120+ --- Done --- ================================================================================ ================================================================================ /local/data/apps/src/php/php-7.1.6/ext/standard/tests/streams/proc_open_bug60120.phpt ================================================================================ string(2049) "*********************************************************************************************************************************************************************************************************************************************************************************************************************************************************************************************************************************************************************************************************************************************************************************************************************************************************************************************************************************************************************************************************************************************************************************************************************************************************************************************************************************************************************************************************************************************************************************************************************************************************************************************************************************************************************************************************************************************************************************************************************************************************************************************************************************************************************************************************************************************************************************************************************************************************************************************************************************************************************************************************************************************************************************************************************************" string(0) "" string(2049) "*********************************************************************************************************************************************************************************************************************************************************************************************************************************************************************************************************************************************************************************************************************************************************************************************************************************************************************************************************************************************************************************************************************************************************************************************************************************************************************************************************************************************************************************************************************************************************************************************************************************************************************************************************************************************************************************************************************************************************************************************************************************************************************************************************************************************************************************************************************************************************************************************************************************************************************************************************************************************************************************************************************************************************************************************************************************" string(0) "" ===DONE=== ================================================================================ 002+ string(0) "" 004- string(0) "" ================================================================================ ================================================================================ /local/data/apps/src/php/php-7.1.6/sapi/phpdbg/tests/breakpoints_001.phpt ================================================================================ [Successful compilation of /local/data/apps/src/php/php-7.1.6/sapi/phpdbg/tests/breakpoints_001.php] prompt> [Breakpoint #0 added at /local/data/apps/src/php/php-7.1.6/sapi/phpdbg/tests/breakpoints_001.php:3] prompt> [Breakpoint #0 at /local/data/apps/src/php/php-7.1.6/sapi/phpdbg/tests/breakpoints_001.php:3, hits: 1] >00003: echo $i++; 00004: echo $i++; 00005: echo $i++; prompt> [Breakpoint #1 added at /local/data/apps/src/php/php-7.1.6/sapi/phpdbg/tests/breakpoints_001.php:4] prompt> 1 [Breakpoint #1 at /local/data/apps/src/php/php-7.1.6/sapi/phpdbg/tests/breakpoints_001.php:4, hits: 1] >00004: echo $i++; 00005: echo $i++; 00006: echo $i++; prompt> 234 [Script ended normally] Termsig=11 ================================================================================ 015+ 015- prompt> 016+ Termsig=11 ================================================================================ ================================================================================ /local/data/apps/src/php/php-7.1.6/sapi/phpdbg/tests/breakpoints_002.phpt ================================================================================ [Successful compilation of /local/data/apps/src/php/php-7.1.6/sapi/phpdbg/tests/breakpoints_002.php] prompt> [Breakpoint #0 added at /local/data/apps/src/php/php-7.1.6/sapi/phpdbg/tests/breakpoints_002.php:4] prompt> 1 [Breakpoint #0 at /local/data/apps/src/php/php-7.1.6/sapi/phpdbg/tests/breakpoints_002.php:4, hits: 1] >00004: echo $i++; 00005: echo $i++; 00006: echo $i++; prompt> [Breakpoint #1 added at /local/data/apps/src/php/php-7.1.6/sapi/phpdbg/tests/breakpoints_002.php:3] prompt> Do you really want to restart execution? (type y or n): Termsig=11 ================================================================================ 009+ prompt> Do you really want to restart execution? (type y or n): 010+ Termsig=11 009- prompt> Do you really want to restart execution? (type y or n): [Breakpoint #1 at %s:3, hits: 1] 010- >00003: echo $i++; 011- 00004: echo $i++; 012- 00005: echo $i++; 013- prompt> 1 014- [Breakpoint #0 at %s:4, hits: 1] 015- >00004: echo $i++; 016- 00005: echo $i++; 017- 00006: echo $i++; 018- prompt> 234 019- [Script ended normally] 020- prompt> ================================================================================ ================================================================================ /local/data/apps/src/php/php-7.1.6/sapi/phpdbg/tests/breakpoints_003.phpt ================================================================================ [Successful compilation of /local/data/apps/src/php/php-7.1.6/sapi/phpdbg/tests/breakpoints_003.php] prompt> [Breakpoint #0 added at /local/data/apps/src/php/php-7.1.6/sapi/phpdbg/tests/breakpoints_003.php:4] prompt> [Deleted breakpoint #0] prompt> [Breakpoint #1 added at /local/data/apps/src/php/php-7.1.6/sapi/phpdbg/tests/breakpoints_003.php:5] prompt> 12 [Breakpoint #1 at /local/data/apps/src/php/php-7.1.6/sapi/phpdbg/tests/breakpoints_003.php:5, hits: 1] >00005: echo $i++; 00006: echo $i++; 00007: prompt> [Deleted breakpoint #1] prompt> Do you really want to restart execution? (type y or n): Termsig=11 ================================================================================ 011+ prompt> Do you really want to restart execution? (type y or n): 012+ Termsig=11 011- prompt> Do you really want to restart execution? (type y or n): 1234 012- [Script ended normally] 013- prompt> ================================================================================ ================================================================================ /local/data/apps/src/php/php-7.1.6/sapi/phpdbg/tests/breakpoints_004.phpt ================================================================================ [Successful compilation of /local/data/apps/src/php/php-7.1.6/sapi/phpdbg/tests/breakpoints_004.php] prompt> [Breakpoint #0 added at ZEND_ECHO] prompt> [Breakpoint #0 in ZEND_ECHO at /local/data/apps/src/php/php-7.1.6/sapi/phpdbg/tests/breakpoints_004.php:3, hits: 1] >00003: echo $i++; 00004: echo $i++; 00005: echo $i++; prompt> 1 [Breakpoint #0 in ZEND_ECHO at /local/data/apps/src/php/php-7.1.6/sapi/phpdbg/tests/breakpoints_004.php:4, hits: 2] >00004: echo $i++; 00005: echo $i++; 00006: echo $i++; prompt> 2 [Breakpoint #0 in ZEND_ECHO at /local/data/apps/src/php/php-7.1.6/sapi/phpdbg/tests/breakpoints_004.php:5, hits: 3] >00005: echo $i++; 00006: echo $i++; 00007: prompt> 3 [Breakpoint #0 in ZEND_ECHO at /local/data/apps/src/php/php-7.1.6/sapi/phpdbg/tests/breakpoints_004.php:6, hits: 4] >00006: echo $i++; 00007: prompt> 4 [Script ended normally] Termsig=11 ================================================================================ 023+ 023- prompt> 024+ Termsig=11 ================================================================================ ================================================================================ /local/data/apps/src/php/php-7.1.6/sapi/phpdbg/tests/breakpoints_005.phpt ================================================================================ [Successful compilation of /local/data/apps/src/php/php-7.1.6/sapi/phpdbg/tests/breakpoints_005.php] prompt> [Breakpoint #0 added at /local/data/apps/src/php/php-7.1.6/sapi/phpdbg/tests/breakpoints_005.php:4] prompt> [Breakpoint #0 at /local/data/apps/src/php/php-7.1.6/sapi/phpdbg/tests/breakpoints_005.php:4, hits: 1] >00004: var_dump($bar); 00005: } 00006: prompt> test prompt> string(4) "test" [Script ended normally] Termsig=11 ================================================================================ 010+ 010- prompt> 011+ Termsig=11 ================================================================================ ================================================================================ /local/data/apps/src/php/php-7.1.6/sapi/phpdbg/tests/breakpoints_006.phpt ================================================================================ [Successful compilation of /local/data/apps/src/php/php-7.1.6/sapi/phpdbg/tests/breakpoints_006.php] prompt> [Breakpoint #0 added at foo] prompt> [Breakpoint #0 in foo() at /local/data/apps/src/php/php-7.1.6/sapi/phpdbg/tests/breakpoints_006.php:4, hits: 1] >00004: var_dump($bar); 00005: } 00006: prompt> string(4) "test" [Script ended normally] Termsig=11 ================================================================================ 009+ 009- prompt> 010+ Termsig=11 ================================================================================ ================================================================================ /local/data/apps/src/php/php-7.1.6/sapi/phpdbg/tests/breakpoints_008.phpt ================================================================================ [Successful compilation of /local/data/apps/src/php/php-7.1.6/sapi/phpdbg/tests/breakpoints_008.php] prompt> [Breakpoint #0 added at foo\bar::foo] prompt> [Breakpoint exists at Foo\Bar::Foo] prompt> [Breakpoint #0 in foo\bar::foo() at /local/data/apps/src/php/php-7.1.6/sapi/phpdbg/tests/breakpoints_008.php:6, hits: 1] >00006: var_dump($bar); 00007: } 00008: } prompt> string(4) "test" [Script ended normally] Termsig=11 ================================================================================ 010+ 010- prompt> 011+ Termsig=11 ================================================================================ ================================================================================ /local/data/apps/src/php/php-7.1.6/sapi/phpdbg/tests/bug73704.phpt ================================================================================ [Successful compilation of /local/data/apps/src/php/php-7.1.6/sapi/phpdbg/tests/bug73704.php] prompt> 00001: #!/usr/bin/env php 00002: <?php 00003: 00004: echo 1; 00005: prompt> [Breakpoint #0 added at /local/data/apps/src/php/php-7.1.6/sapi/phpdbg/tests/bug73704.php:4] prompt> [Breakpoint #0 at /local/data/apps/src/php/php-7.1.6/sapi/phpdbg/tests/bug73704.php:4, hits: 1] >00004: echo 1; 00005: prompt> 1 [Script ended normally] Termsig=11 ================================================================================ 013+ 013- prompt> 014+ Termsig=11 ================================================================================ ================================================================================ /local/data/apps/src/php/php-7.1.6/sapi/phpdbg/tests/clean_001.phpt ================================================================================ [Successful compilation of /local/data/apps/src/php/php-7.1.6/sapi/phpdbg/tests/clean_001.php] prompt> [Breakpoint #0 added at /local/data/apps/src/php/php-7.1.6/sapi/phpdbg/tests/clean_001.php:4] prompt> [Breakpoint #1 added at foo] prompt> 1 [Breakpoint #0 at /local/data/apps/src/php/php-7.1.6/sapi/phpdbg/tests/clean_001.php:4, hits: 1] >00004: echo 2; 00005: echo 3; 00006: foo(); prompt> 23 [Breakpoint #1 in foo() at /local/data/apps/src/php/php-7.1.6/sapi/phpdbg/tests/clean_001.php:9, hits: 1] >00009: echo 4; 00010: } 00011: prompt> Do you really want to clean your current environment? (type y or n): Cleaning Execution Environment Classes 153 Functions 864 Constants 852 Includes 0 Termsig=11 ================================================================================ 019+ 020+ Termsig=11 019- prompt> [Not running] 020- prompt> 1 021- [Breakpoint #0 at %s:4, hits: 1] 022- >00004: echo 2; 023- 00005: echo 3; 024- 00006: foo(); 025- prompt> 23 026- [Breakpoint #1 in foo() at %s:9, hits: 1] 027- >00009: echo 4; 028- 00010: } 029- 00011: 030- prompt> 4 031- [Script ended normally] 032- prompt> ================================================================================ ================================================================================ /local/data/apps/src/php/php-7.1.6/sapi/phpdbg/tests/clear_001.phpt ================================================================================ [Successful compilation of /local/data/apps/src/php/php-7.1.6/sapi/phpdbg/tests/clear_001.php] prompt> [Breakpoint #0 added at /local/data/apps/src/php/php-7.1.6/sapi/phpdbg/tests/clear_001.php:4] prompt> [Breakpoint #1 added at foo] prompt> 1 [Breakpoint #0 at /local/data/apps/src/php/php-7.1.6/sapi/phpdbg/tests/clear_001.php:4, hits: 1] >00004: echo 2; 00005: echo 3; 00006: foo(); prompt> Clearing Breakpoints File 1 Functions 1 Methods 0 Oplines 0 File oplines 0 Function oplines 0 Method oplines 0 Conditionals 0 prompt> 234 [Script ended normally] Termsig=11 ================================================================================ 020+ 020- prompt> prompt> 021+ Termsig=11 ================================================================================ ================================================================================ /local/data/apps/src/php/php-7.1.6/sapi/phpdbg/tests/exceptions_001.phpt ================================================================================ [Successful compilation of /local/data/apps/src/php/php-7.1.6/sapi/phpdbg/tests/exceptions_001.php] prompt> handle first [Uncaught Error in /local/data/apps/src/php/php-7.1.6/sapi/phpdbg/tests/exceptions_001.php on line 16: Call to undefined function foo()] >00016: foo(); // Error 00017: } catch (\Exception $e) { 00018: var_dump($e); prompt> frame #0: {closure}() at /local/data/apps/src/php/php-7.1.6/sapi/phpdbg/tests/exceptions_001.php:16 frame #1: {main} at /local/data/apps/src/php/php-7.1.6/sapi/phpdbg/tests/exceptions_001.php:22 prompt> 3 prompt> [Uncaught Error in /local/data/apps/src/php/php-7.1.6/sapi/phpdbg/tests/exceptions_001.php on line 16] Error: Call to undefined function foo() in /local/data/apps/src/php/php-7.1.6/sapi/phpdbg/tests/exceptions_001.php:16 Stack trace: #0 /local/data/apps/src/php/php-7.1.6/sapi/phpdbg/tests/exceptions_001.php(22): {closure}() #1 {main} [Script ended normally] Termsig=11 ================================================================================ 016+ 016- prompt> 017+ Termsig=11 ================================================================================ ================================================================================ /local/data/apps/src/php/php-7.1.6/sapi/phpdbg/tests/exceptions_002.phpt ================================================================================ [Successful compilation of /local/data/apps/src/php/php-7.1.6/sapi/phpdbg/tests/exceptions_002.php] prompt> handle first [Uncaught Error in /local/data/apps/src/php/php-7.1.6/sapi/phpdbg/tests/exceptions_002.php on line 16: Call to undefined function foo()] >00016: foo(); // Error 00017: } catch (\Exception $e) { 00018: var_dump($e); prompt> Fatal error: Uncaught Error: Call to undefined function next_error() in eval()'d code:1 Stack trace: #0 /local/data/apps/src/php/php-7.1.6/sapi/phpdbg/tests/exceptions_002.php(16): unknown() #1 /local/data/apps/src/php/php-7.1.6/sapi/phpdbg/tests/exceptions_002.php(20): {closure}() #2 {main} thrown in eval()'d code on line 1 prompt> [Uncaught Error in /local/data/apps/src/php/php-7.1.6/sapi/phpdbg/tests/exceptions_002.php on line 16] Error: Call to undefined function foo() in /local/data/apps/src/php/php-7.1.6/sapi/phpdbg/tests/exceptions_002.php:16 Stack trace: #0 /local/data/apps/src/php/php-7.1.6/sapi/phpdbg/tests/exceptions_002.php(20): {closure}() #1 {main} [Script ended normally] Termsig=11 ================================================================================ 020+ 021+ Termsig=11 020- prompt> [The stack contains nothing !] 021- prompt> ================================================================================ ================================================================================ /local/data/apps/src/php/php-7.1.6/sapi/phpdbg/tests/generator_run.phpt ================================================================================ [Successful compilation of /local/data/apps/src/php/php-7.1.6/sapi/phpdbg/tests/generator_run.php] prompt> caught Generator exception [Script ended normally] Termsig=11 ================================================================================ 004+ 004- prompt> 005+ Termsig=11 ================================================================================ ================================================================================ /local/data/apps/src/php/php-7.1.6/sapi/phpdbg/tests/include_once.phpt ================================================================================ [Successful compilation of /local/data/apps/src/php/php-7.1.6/sapi/phpdbg/tests/include_once.php] prompt> 1 [Script ended normally] Termsig=11 ================================================================================ 004+ 004- prompt> 005+ Termsig=11 ================================================================================ ================================================================================ /local/data/apps/src/php/php-7.1.6/sapi/phpdbg/tests/info_001.phpt ================================================================================ [Successful compilation of /local/data/apps/src/php/php-7.1.6/sapi/phpdbg/tests/info_001.php] prompt> [User Classes (1)] User Class Foo\Bar (2) |---- in /local/data/apps/src/php/php-7.1.6/sapi/phpdbg/tests/info_001.php on line 4 prompt> [User Functions (1)] |-------- foo in /local/data/apps/src/php/php-7.1.6/sapi/phpdbg/tests/info_001.php on line 14 prompt> [Breakpoint #0 added at foo] prompt> string(4) "test" [Breakpoint #0 in foo() at /local/data/apps/src/php/php-7.1.6/sapi/phpdbg/tests/info_001.php:15, hits: 1] >00015: var_dump(strrev($baz)); 00016: } 00017: prompt> [Variables in foo() (1)] Address Refs Type Variable 0x7fc21b6150e0 1 string $baz string (4) "test" prompt> [Superglobal variables (8)] Address Refs Type Variable 0x7fc21b65eb60 2 array $_GET 0x7fc21b65eb80 2 array $_POST 0x7fc21b65eba0 2 array $_COOKIE 0x7fc21b65ebc0 2 array $_SERVER 0x7fc21b65ebe0 2 array $_ENV 0x7fc21b65ec00 1 array $_REQUEST 0x7fc21b65ec20 2 array $_FILES 0x7fc21b657080 1 array &$GLOBALS prompt> ------------------------------------------------ Function Breakpoints: #0 foo prompt> [User-defined constants (0)] prompt> [Included files: 0] prompt> [No error found!] prompt> [Literal Constants in foo() (2)] |-------- C0 -------> [var_dump] |-------- C1 -------> [strrev] prompt> string(4) "tset" [Script ended normally] Termsig=11 ================================================================================ 038+ 039+ Termsig=11 038- prompt> [No active op array!] 039- prompt> ================================================================================ ================================================================================ /local/data/apps/src/php/php-7.1.6/sapi/phpdbg/tests/normal_exit.phpt ================================================================================ [Successful compilation of /local/data/apps/src/php/php-7.1.6/sapi/phpdbg/tests/normal_exit.php] prompt> [Script ended normally] Termsig=11 ================================================================================ 003+ 003- prompt> 004+ Termsig=11 ================================================================================ ================================================================================ /local/data/apps/src/php/php-7.1.6/sapi/phpdbg/tests/phpdbg_break_next.phpt ================================================================================ [Successful compilation of /local/data/apps/src/php/php-7.1.6/sapi/phpdbg/tests/phpdbg_break_next.php] prompt> A [Breakpoint #0 added at 7f5fc8d56310] [Breakpoint #0 in 7f5fc8d56310 at /local/data/apps/src/php/php-7.1.6/sapi/phpdbg/tests/phpdbg_break_next.php:5, hits: 1] >00005: echo 'B'; 00006: prompt> B [Script ended normally] Termsig=11 ================================================================================ 009+ 009- prompt> 010+ Termsig=11 ================================================================================ ================================================================================ /local/data/apps/src/php/php-7.1.6/sapi/phpdbg/tests/phpdbg_get_executable_stream_wrapper.phpt ================================================================================ [Successful compilation of /local/data/apps/src/php/php-7.1.6/sapi/phpdbg/tests/phpdbg_get_executable_stream_wrapper.php] prompt> array(1) { [5]=> int(0) } [Script ended normally] Termsig=11 ================================================================================ 007+ 007- prompt> 008+ Termsig=11 ================================================================================ ================================================================================ /local/data/apps/src/php/php-7.1.6/sapi/phpdbg/tests/phpdbg_oplog_001.phpt ================================================================================ [Successful compilation of /local/data/apps/src/php/php-7.1.6/sapi/phpdbg/tests/phpdbg_oplog_001.php] prompt> halloarray(2) { ["/local/data/apps/src/php/php-7.1.6/sapi/phpdbg/tests/phpdbg_oplog_001.php"]=> array(5) { [13]=> int(1) [17]=> int(2) [18]=> int(2) [19]=> int(3) [21]=> int(4) } ["A::b"]=> array(3) { [4]=> int(1) [5]=> int(3) [8]=> int(2) } } [Script ended normally] Termsig=11 ================================================================================ 027+ 027- prompt> 028+ Termsig=11 ================================================================================ ================================================================================ /local/data/apps/src/php/php-7.1.6/sapi/phpdbg/tests/phpdbg_oplog_002.phpt ================================================================================ [Successful compilation of /local/data/apps/src/php/php-7.1.6/sapi/phpdbg/tests/phpdbg_oplog_002.php] prompt> Warning: Can not end an oplog without starting it in /local/data/apps/src/php/php-7.1.6/sapi/phpdbg/tests/phpdbg_oplog_002.php on line 3 NULL [Script ended normally] Termsig=11 ================================================================================ 006+ 006- prompt> 007+ Termsig=11 ================================================================================ ================================================================================ /local/data/apps/src/php/php-7.1.6/sapi/phpdbg/tests/run_001.phpt ================================================================================ [Successful compilation of /local/data/apps/src/php/php-7.1.6/sapi/phpdbg/tests/run_001.php] prompt> int(5) array(5) { [0]=> string(64) "/local/data/apps/src/php/php-7.1.6/sapi/phpdbg/tests/run_001.php" [1]=> string(2) "--" [2]=> string(1) "1" [3]=> string(1) "2" [4]=> string(1) "3" } [Script ended normally] ================================================================================ 016- prompt> int(5) 017- array(4) { 018- [0]=> 019- string(%d) "%s" 020- [1]=> 021- string(1) "1" 022- [2]=> 023- string(1) "2" 024- [3]=> 025- string(1) "3" 026- } 027- [Script ended normally] 028- prompt> int(5) 029- array(5) { 030- [0]=> 031- string(%d) "%s" 032- [1]=> 033- string(2) "--" 034- [2]=> 035- string(1) "1" 036- [3]=> 037- string(1) "2" 038- [4]=> 039- string(1) "3" 040- } 041- [Script ended normally] 042- prompt> ================================================================================ ================================================================================ /local/data/apps/src/php/php-7.1.6/sapi/phpdbg/tests/run_002.phpt ================================================================================ [Successful compilation of /local/data/apps/src/php/php-7.1.6/sapi/phpdbg/tests/run_002.php] prompt> 10 prompt> [Breakpoint #0 added at /local/data/apps/src/php/php-7.1.6/sapi/phpdbg/tests/run_002.php:6] prompt> array(1) { [0]=> string(64) "/local/data/apps/src/php/php-7.1.6/sapi/phpdbg/tests/run_002.php" } string(10) "stdin data" [Breakpoint #0 at /local/data/apps/src/php/php-7.1.6/sapi/phpdbg/tests/run_002.php:6, hits: 1] >00006: echo "ok\n"; 00007: prompt> Do you really want to restart execution? (type y or n): Termsig=11 ================================================================================ 013+ prompt> Do you really want to restart execution? (type y or n): 014+ Termsig=11 013- prompt> Do you really want to restart execution? (type y or n): array(3) { 014- [0]=> 015- string(%d) "%s" 016- [1]=> 017- string(4) "arg1" 018- [2]=> 019- string(10) "_ ' arg2 "" 020- } 021- string(10) "stdin 022- data" 023- [Breakpoint #0 at %s:6, hits: 1] 024- >00006: echo "ok\n"; 025- 00007: 026- prompt> ok 027- [Script ended normally] 028- prompt> ================================================================================ ================================================================================ /local/data/apps/src/php/php-7.1.6/sapi/phpdbg/tests/set_exception_handler.phpt ================================================================================ [Successful compilation of /local/data/apps/src/php/php-7.1.6/sapi/phpdbg/tests/set_exception_handler.php] prompt> [Uncaught Exception in /local/data/apps/src/php/php-7.1.6/sapi/phpdbg/tests/set_exception_handler.php on line 4: test] >00004: throw new Exception("test"); 00005: prompt> EX [Script ended normally] Termsig=11 ================================================================================ 007+ 007- prompt> 008+ Termsig=11 ================================================================================ ================================================================================ /local/data/apps/src/php/php-7.1.6/sapi/phpdbg/tests/stdin_001.phpt ================================================================================ prompt> [Successful compilation of stdin input] prompt> [Breakpoint #0 added at -:3] prompt> [Breakpoint #0 at -:3, hits: 1] >00003: echo "Hello, world!\n"; 00004: prompt> Hello, world! [Script ended normally] Termsig=11 ================================================================================ 008+ 009+ Termsig=11 008- prompt> [Breakpoint #0 at -:3, hits: 1] 009- >00003: echo "Hello, world!\n"; 010- 00004: 011- prompt> ================================================================================ ================================================================================ /local/data/apps/src/php/php-7.1.6/sapi/phpdbg/tests/watch_001.phpt ================================================================================ [Successful compilation of /local/data/apps/src/php/php-7.1.6/sapi/phpdbg/tests/watch_001.php] prompt> [Breakpoint #0 added at /local/data/apps/src/php/php-7.1.6/sapi/phpdbg/tests/watch_001.php:3] prompt> [Breakpoint #0 at /local/data/apps/src/php/php-7.1.6/sapi/phpdbg/tests/watch_001.php:3, hits: 1] >00003: $a = 1; 00004: $b = [$a]; 00005: prompt> [Added recursive watchpoint #0 for $b] prompt> [Breaking on watchpoint $b] Old value: New value: Array ([0] => 1) >00006: unset($b); 00007: $b = 2; 00008: prompt> [Breaking on watchpoint $b] Old value inaccessible or destroyed New value: >00007: $b = 2; 00008: prompt> [Breaking on watchpoint $b] Old value: New value: 2 >00008: prompt> [$b has been removed, removing watchpoint recursively] [Script ended normally] Termsig=11 ================================================================================ 025+ 025- prompt> 026+ Termsig=11 ================================================================================ ================================================================================ /local/data/apps/src/php/php-7.1.6/sapi/phpdbg/tests/watch_002.phpt ================================================================================ [Successful compilation of /local/data/apps/src/php/php-7.1.6/sapi/phpdbg/tests/watch_002.php] prompt> [Breakpoint #0 added at /local/data/apps/src/php/php-7.1.6/sapi/phpdbg/tests/watch_002.php:6] prompt> [Breakpoint #0 at /local/data/apps/src/php/php-7.1.6/sapi/phpdbg/tests/watch_002.php:6, hits: 1] >00006: $a[0] = 2; 00007: 00008: $a = [0 => 3, 1 => 4]; prompt> [Added watchpoint #0 for $a[]] prompt> [Breaking on watchpoint $a[]] 1 elements were added to the array >00009: prompt> [$a[] has been removed, removing watchpoint] [Script ended normally] Termsig=11 ================================================================================ 013+ 013- prompt> 014+ Termsig=11 ================================================================================ ================================================================================ /local/data/apps/src/php/php-7.1.6/sapi/phpdbg/tests/watch_003.phpt ================================================================================ [Successful compilation of /local/data/apps/src/php/php-7.1.6/sapi/phpdbg/tests/watch_003.php] prompt> [Breakpoint #0 added at /local/data/apps/src/php/php-7.1.6/sapi/phpdbg/tests/watch_003.php:6] prompt> [Breakpoint #0 at /local/data/apps/src/php/php-7.1.6/sapi/phpdbg/tests/watch_003.php:6, hits: 1] >00006: $a[0] = 2; 00007: 00008: $a = [0 => 3, 1 => 4]; prompt> [Added watchpoint #0 for $a[0]] prompt> [Breaking on watchpoint $a[0]] Old value: 1 New value: 2 >00008: $a = [0 => 3, 1 => 4]; 00009: prompt> [Breaking on watchpoint $a[0]] Old value: 2 New value: 3 >00009: prompt> [$a[0] has been removed, removing watchpoint] [Script ended normally] Termsig=11 ================================================================================ 019+ 019- prompt> 020+ Termsig=11 ================================================================================ ================================================================================ /local/data/apps/src/php/php-7.1.6/sapi/phpdbg/tests/watch_004.phpt ================================================================================ [Successful compilation of /local/data/apps/src/php/php-7.1.6/sapi/phpdbg/tests/watch_004.php] prompt> [Breakpoint #0 added at /local/data/apps/src/php/php-7.1.6/sapi/phpdbg/tests/watch_004.php:3] prompt> [Breakpoint #0 at /local/data/apps/src/php/php-7.1.6/sapi/phpdbg/tests/watch_004.php:3, hits: 1] >00003: $b = "a"; 00004: $a = $b.$b; 00005: $a[1] = "b"; prompt> [Added watchpoint #0 for $a] prompt> [Breaking on watchpoint $a] Old value: New value: aa >00005: $a[1] = "b"; 00006: prompt> [Breaking on watchpoint $a] Old value: aa New value: ab >00006: prompt> [$a has been removed, removing watchpoint] [Script ended normally] Termsig=11 ================================================================================ 019+ 019- prompt> 020+ Termsig=11 ================================================================================ ================================================================================ /local/data/apps/src/php/php-7.1.6/sapi/phpdbg/tests/watch_005.phpt ================================================================================ [Successful compilation of /local/data/apps/src/php/php-7.1.6/sapi/phpdbg/tests/watch_005.php] prompt> [Breakpoint #0 added at /local/data/apps/src/php/php-7.1.6/sapi/phpdbg/tests/watch_005.php:3] prompt> [Breakpoint #0 at /local/data/apps/src/php/php-7.1.6/sapi/phpdbg/tests/watch_005.php:3, hits: 1] >00003: $b = "a"; 00004: $a = $b.$b; 00005: $c = &$a; prompt> [Added recursive watchpoint #0 for $a] prompt> [Breaking on watchpoint $a] Old value: New value: aa >00005: $c = &$a; 00006: $a[1] = "b"; 00007: prompt> [Breaking on watchpoint $a] Old value inaccessible or destroyed New value (reference): aa >00006: $a[1] = "b"; 00007: 00008: exit; prompt> [Breaking on watchpoint $a] Old value: aa New value: ab >00008: exit; 00009: prompt> [$a has been removed, removing watchpoint recursively] [Script ended normally] Termsig=11 ================================================================================ 027+ 027- prompt> 028+ Termsig=11 ================================================================================ ================================================================================ /local/data/apps/src/php/php-7.1.6/sapi/phpdbg/tests/watch_006.phpt ================================================================================ [Successful compilation of /local/data/apps/src/php/php-7.1.6/sapi/phpdbg/tests/watch_006.php] prompt> [Breakpoint #0 added at /local/data/apps/src/php/php-7.1.6/sapi/phpdbg/tests/watch_006.php:4] prompt> [Breakpoint #0 at /local/data/apps/src/php/php-7.1.6/sapi/phpdbg/tests/watch_006.php:4, hits: 1] >00004: $a[0] = 1; 00005: $b = &$a; 00006: $a[0] = 2; prompt> [Added watchpoint #0 for $a[0]] prompt> [Added recursive watchpoint #1 for $b] prompt> [Breaking on watchpoint $a[0]] Old value: 0 New value: 1 >00005: $b = &$a; 00006: $a[0] = 2; 00007: $a[1] = 3; prompt> [Breaking on watchpoint $b] Old value: New value (reference): Array ([0] => 1) >00006: $a[0] = 2; 00007: $a[1] = 3; 00008: $c = [1]; prompt> [Breaking on watchpoint $a[0]] Old value: 1 New value: 2 >00007: $a[1] = 3; 00008: $c = [1]; 00009: $b = &$c; prompt> [Element 1 has been added to watchpoint] [Breaking on watchpoint $b[]] 1 elements were added to the array >00008: $c = [1]; 00009: $b = &$c; 00010: prompt> [Breaking on watchpoint $b] Old value inaccessible or destroyed New value (reference): Array ([0] => 2,[1] => 3) >00009: $b = &$c; 00010: prompt> [Breaking on watchpoint $b] Old value inaccessible or destroyed New value (reference): Array ([0] => 1) >00010: prompt> [$b has been removed, removing watchpoint recursively] [$a[0] has been removed, removing watchpoint] [Script ended normally] Termsig=11 ================================================================================ 045+ 045- prompt> 046+ Termsig=11 ================================================================================ ================================================================================ BUILD ENVIRONMENT ================================================================================ OS: Linux - Linux kw14934.cbrc.kaust.edu.sa 3.10.0-229.1.2.el7.x86_64 #1 SMP Fri Mar 27 03:04:26 UTC 2015 x86_64 Autoconf: autoconf (GNU Autoconf) 2.69 Copyright (C) 2012 Free Software Foundation, Inc. License GPLv3+/Autoconf: GNU GPL version 3 or later <http://gnu.org/licenses/gpl.html>, <http://gnu.org/licenses/exceptions.html> This is free software: you are free to change and redistribute it. There is NO WARRANTY, to the extent permitted by law. Written by David J. MacKenzie and Akim Demaille. Bundled Libtool: ltmain.sh (GNU libtool) 1.5.26 (1.1220.2.492 2008/01/30 06:40:56) Copyright (C) 2008 Free Software Foundation, Inc. This is free software; see the source for copying conditions. There is NO warranty; not even for MERCHANTABILITY or FITNESS FOR A PARTICULAR PURPOSE. System Libtool: libtool (GNU libtool) 2.4.2 Written by Gordon Matzigkeit <gord@gnu.ai.mit.edu>, 1996 Copyright (C) 2011 Free Software Foundation, Inc. This is free software; see the source for copying conditions. There is NO warranty; not even for MERCHANTABILITY or FITNESS FOR A PARTICULAR PURPOSE. Compiler: Using built-in specs. COLLECT_GCC=cc COLLECT_LTO_WRAPPER=/usr/libexec/gcc/x86_64-redhat-linux/4.8.5/lto-wrapper Target: x86_64-redhat-linux Configured with: ../configure --prefix=/usr --mandir=/usr/share/man --infodir=/usr/share/info --with-bugurl=http://bugzilla.redhat.com/bugzilla --enable-bootstrap --enable-shared --enable-threads=posix --enable-checking=release --with-system-zlib --enable-__cxa_atexit --disable-libunwind-exceptions --enable-gnu-unique-object --enable-linker-build-id --with-linker-hash-style=gnu --enable-languages=c,c++,objc,obj-c++,java,fortran,ada,go,lto --enable-plugin --enable-initfini-array --disable-libgcj --with-isl=/builddir/build/BUILD/gcc-4.8.5-20150702/obj-x86_64-redhat-linux/isl-install --with-cloog=/builddir/build/BUILD/gcc-4.8.5-20150702/obj-x86_64-redhat-linux/cloog-install --enable-gnu-indirect-function --with-tune=generic --with-arch_32=x86-64 --build=x86_64-redhat-linux Thread model: posix gcc version 4.8.5 20150623 (Red Hat 4.8.5-4) (GCC) Bison: bison (GNU Bison) 2.7 Written by Robert Corbett and Richard Stallman. Copyright (C) 2012 Free Software Foundation, Inc. This is free software; see the source for copying conditions. There is NO warranty; not even for MERCHANTABILITY or FITNESS FOR A PARTICULAR PURPOSE. Libraries: linux-vdso.so.1 => (0x00007fff4b1e7000) libcrypt.so.1 => /usr/lib64/libcrypt.so.1 (0x00007f53d17fd000) libz.so.1 => /usr/lib64/libz.so.1 (0x00007f53d15e7000) libresolv.so.2 => /usr/lib64/libresolv.so.2 (0x00007f53d13cc000) librt.so.1 => /usr/lib64/librt.so.1 (0x00007f53d11c4000) libstdc++.so.6 => /usr/lib64/libstdc++.so.6 (0x00007f53d0ebc000) libpng15.so.15 => /usr/lib64/libpng15.so.15 (0x00007f53d0c90000) libjpeg.so.62 => /usr/lib64/libjpeg.so.62 (0x00007f53d0a3b000) libcurl.so.4 => /usr/lib64/libcurl.so.4 (0x00007f53d07d2000) libbz2.so.1 => /usr/lib64/libbz2.so.1 (0x00007f53d05c1000) libm.so.6 => /usr/lib64/libm.so.6 (0x00007f53d02bf000) libdl.so.2 => /usr/lib64/libdl.so.2 (0x00007f53d00bb000) libnsl.so.1 => /usr/lib64/libnsl.so.1 (0x00007f53cfea1000) libpthread.so.0 => /usr/lib64/libpthread.so.0 (0x00007f53cfc85000) libxml2.so.2 => /usr/lib64/libxml2.so.2 (0x00007f53cf91c000) libssl.so.10 => /usr/lib64/libssl.so.10 (0x00007f53cf6ae000) libcrypto.so.10 => /usr/lib64/libcrypto.so.10 (0x00007f53cf2c6000) libfreetype.so.6 => /usr/lib64/libfreetype.so.6 (0x00007f53cf020000) libicui18n.so.50 => /usr/lib64/libicui18n.so.50 (0x00007f53cec20000) libicuuc.so.50 => /usr/lib64/libicuuc.so.50 (0x00007f53ce8a7000) libicudata.so.50 => /usr/lib64/libicudata.so.50 (0x00007f53cd2d3000) libicuio.so.50 => /usr/lib64/libicuio.so.50 (0x00007f53cd0c4000) libgcc_s.so.1 => /usr/lib64/libgcc_s.so.1 (0x00007f53cceae000) libc.so.6 => /usr/lib64/libc.so.6 (0x00007f53ccaec000) /lib64/ld-linux-x86-64.so.2 (0x00007f53d1a35000) libfreebl3.so => /usr/lib64/libfreebl3.so (0x00007f53cc8e8000) libidn.so.11 => /usr/lib64/libidn.so.11 (0x00007f53cc6b5000) libssh2.so.1 => /usr/lib64/libssh2.so.1 (0x00007f53cc48b000) libssl3.so => /usr/lib64/libssl3.so (0x00007f53cc247000) libsmime3.so => /usr/lib64/libsmime3.so (0x00007f53cc020000) libnss3.so => /usr/lib64/libnss3.so (0x00007f53cbcfa000) libnssutil3.so => /usr/lib64/libnssutil3.so (0x00007f53cbacd000) libplds4.so => /usr/lib64/libplds4.so (0x00007f53cb8c9000) libplc4.so => /usr/lib64/libplc4.so (0x00007f53cb6c4000) libnspr4.so => /usr/lib64/libnspr4.so (0x00007f53cb485000) libgssapi_krb5.so.2 => /usr/lib64/libgssapi_krb5.so.2 (0x00007f53cb239000) libkrb5.so.3 => /usr/lib64/libkrb5.so.3 (0x00007f53caf54000) libk5crypto.so.3 => /usr/lib64/libk5crypto.so.3 (0x00007f53cad21000) libcom_err.so.2 => /usr/lib64/libcom_err.so.2 (0x00007f53cab1d000) liblber-2.4.so.2 => /usr/lib64/liblber-2.4.so.2 (0x00007f53ca90e000) libldap-2.4.so.2 => /usr/lib64/libldap-2.4.so.2 (0x00007f53ca6ba000) liblzma.so.5 => /usr/lib64/liblzma.so.5 (0x00007f53ca495000) libkrb5support.so.0 => /usr/lib64/libkrb5support.so.0 (0x00007f53ca285000) libkeyutils.so.1 => /usr/lib64/libkeyutils.so.1 (0x00007f53ca081000) libsasl2.so.3 => /usr/lib64/libsasl2.so.3 (0x00007f53c9e63000) libselinux.so.1 => /usr/lib64/libselinux.so.1 (0x00007f53c9c3e000) libpcre.so.1 => /usr/lib64/libpcre.so.1 (0x00007f53c99dc000) ================================================================================ PHPINFO ================================================================================ phpinfo() PHP Version => 7.1.6 System => Linux kw14934.cbrc.kaust.edu.sa 3.10.0-229.1.2.el7.x86_64 #1 SMP Fri Mar 27 03:04:26 UTC 2015 x86_64 Build Date => Jun 14 2017 17:47:53 Configure Command => './configure' '--prefix=/local/apps/php/php-7.1.6' '--with-apxs2=/local/apps/ASF/httpd/2.4.25/bin/apxs' '--enable-dtrace' '--enable-bcmath' '--with-bz2' '--with-curl' '--enable-filter' '--enable-fpm' '--with-gd' '--enable-gd-native-ttf' '--with-freetype-dir' '--with-jpeg-dir' '--with-png-dir' '--enable-intl' '--enable-mbstring' '--enable-mysqlnd' '--with-mysql-sock=/var/lib/mysql/mysql.sock' '--with-mysqli=mysqlnd' '--with-pdo-mysql=mysqlnd' '--with-pdo-sqlite' '--disable-phpdbg' '--disable-phpdbg-webhelper' '--enable-opcache' '--with-openssl' '--enable-simplexml' '--with-sqlite3' '--enable-xmlreader' '--enable-xmlwriter' '--enable-zip' '--with-zlib' Server API => Command Line Interface Virtual Directory Support => enabled Configuration File (php.ini) Path => /local/apps/php/php-7.1.6/lib Loaded Configuration File => (none) Scan this dir for additional .ini files => (none) Additional .ini files parsed => (none) PHP API => 20160303 PHP Extension => 20160303 Zend Extension => 320160303 Zend Extension Build => API320160303,TS PHP Extension Build => API20160303,TS Debug Build => no Thread Safety => enabled Zend Signal Handling => enabled Zend Memory Manager => enabled Zend Multibyte Support => provided by mbstring IPv6 Support => enabled DTrace Support => available, disabled Registered PHP Streams => https, ftps, compress.zlib, compress.bzip2, php, file, glob, data, http, ftp, phar, zip Registered Stream Socket Transports => tcp, udp, unix, udg, ssl, sslv3, tls, tlsv1.0, tlsv1.1, tlsv1.2 Registered Stream Filters => zlib.*, bzip2.*, convert.iconv.*, string.rot13, string.toupper, string.tolower, string.strip_tags, convert.*, consumed, dechunk This program makes use of the Zend Scripting Language Engine: Zend Engine v3.1.0, Copyright (c) 1998-2017 Zend Technologies _______________________________________________________________________ Configuration bcmath BCMath support => enabled Directive => Local Value => Master Value bcmath.scale => 0 => 0 bz2 BZip2 Support => Enabled Stream Wrapper support => compress.bzip2:// Stream Filter support => bzip2.decompress, bzip2.compress BZip2 Version => 1.0.6, 6-Sept-2010 Core PHP Version => 7.1.6 Directive => Local Value => Master Value allow_url_fopen => On => On allow_url_include => Off => Off arg_separator.input => & => & arg_separator.output => & => & auto_append_file => no value => no value auto_globals_jit => On => On auto_prepend_file => no value => no value browscap => no value => no value default_charset => UTF-8 => UTF-8 default_mimetype => text/html => text/html disable_classes => no value => no value disable_functions => no value => no value display_errors => STDERR => STDERR display_startup_errors => Off => Off doc_root => no value => no value docref_ext => no value => no value docref_root => no value => no value enable_dl => On => On enable_post_data_reading => On => On error_append_string => no value => no value error_log => no value => no value error_prepend_string => no value => no value error_reporting => no value => no value expose_php => On => On extension_dir => /local/apps/php/php-7.1.6/lib/php/extensions/no-debug-zts-20160303 => /local/apps/php/php-7.1.6/lib/php/extensions/no-debug-zts-20160303 file_uploads => On => On hard_timeout => 2 => 2 highlight.comment => <font style="color: #FF8000">#FF8000</font> => <font style="color: #FF8000">#FF8000</font> highlight.default => <font style="color: #0000BB">#0000BB</font> => <font style="color: #0000BB">#0000BB</font> highlight.html => <font style="color: #000000">#000000</font> => <font style="color: #000000">#000000</font> highlight.keyword => <font style="color: #007700">#007700</font> => <font style="color: #007700">#007700</font> highlight.string => <font style="color: #DD0000">#DD0000</font> => <font style="color: #DD0000">#DD0000</font> html_errors => Off => Off ignore_repeated_errors => Off => Off ignore_repeated_source => Off => Off ignore_user_abort => Off => Off implicit_flush => On => On include_path => .:/local/apps/php/php-7.1.6/lib/php => .:/local/apps/php/php-7.1.6/lib/php input_encoding => no value => no value internal_encoding => no value => no value log_errors => Off => Off log_errors_max_len => 1024 => 1024 mail.add_x_header => Off => Off mail.force_extra_parameters => no value => no value mail.log => no value => no value max_execution_time => 0 => 0 max_file_uploads => 20 => 20 max_input_nesting_level => 64 => 64 max_input_time => -1 => -1 max_input_vars => 1000 => 1000 memory_limit => 128M => 128M open_basedir => no value => no value output_buffering => 0 => 0 output_encoding => no value => no value output_handler => no value => no value post_max_size => 8M => 8M precision => 14 => 14 realpath_cache_size => 4096K => 4096K realpath_cache_ttl => 120 => 120 register_argc_argv => On => On report_memleaks => On => On report_zend_debug => Off => Off request_order => no value => no value sendmail_from => no value => no value sendmail_path => /usr/sbin/sendmail -t -i => /usr/sbin/sendmail -t -i serialize_precision => -1 => -1 short_open_tag => On => On SMTP => localhost => localhost smtp_port => 25 => 25 sql.safe_mode => Off => Off sys_temp_dir => no value => no value track_errors => Off => Off unserialize_callback_func => no value => no value upload_max_filesize => 2M => 2M upload_tmp_dir => no value => no value user_dir => no value => no value user_ini.cache_ttl => 300 => 300 user_ini.filename => .user.ini => .user.ini variables_order => EGPCS => EGPCS xmlrpc_error_number => 0 => 0 xmlrpc_errors => Off => Off zend.assertions => 1 => 1 zend.detect_unicode => On => On zend.enable_gc => On => On zend.multibyte => Off => Off zend.script_encoding => no value => no value zend.signal_check => Off => Off ctype ctype functions => enabled curl cURL support => enabled cURL Information => 7.29.0 Age => 3 Features AsynchDNS => Yes CharConv => No Debug => No GSS-Negotiate => Yes IDN => Yes IPv6 => Yes krb4 => No Largefile => Yes libz => Yes NTLM => Yes NTLMWB => Yes SPNEGO => No SSL => Yes SSPI => No TLS-SRP => No Protocols => dict, file, ftp, ftps, gopher, http, https, imap, imaps, ldap, ldaps, pop3, pop3s, rtsp, scp, sftp, smtp, smtps, telnet, tftp Host => x86_64-redhat-linux-gnu SSL Version => NSS/3.21 Basic ECC ZLib Version => 1.2.7 libSSH Version => libssh2/1.4.3 date date/time support => enabled "Olson" Timezone Database Version => 2017.2 Timezone Database => internal Default timezone => UTC Directive => Local Value => Master Value date.default_latitude => 31.7667 => 31.7667 date.default_longitude => 35.2333 => 35.2333 date.sunrise_zenith => 90.583333 => 90.583333 date.sunset_zenith => 90.583333 => 90.583333 date.timezone => no value => no value dom DOM/XML => enabled DOM/XML API Version => 20031129 libxml Version => 2.9.1 HTML Support => enabled XPath Support => enabled XPointer Support => enabled Schema Support => enabled RelaxNG Support => enabled fileinfo fileinfo support => enabled version => 1.0.5 libmagic => 522 filter Input Validation and Filtering => enabled Revision => $Id: cdc5e15bb616f10210b94ecd8789e66c927a375f $ Directive => Local Value => Master Value filter.default => unsafe_raw => unsafe_raw filter.default_flags => no value => no value gd GD Support => enabled GD Version => bundled (2.1.0 compatible) FreeType Support => enabled FreeType Linkage => with freetype FreeType Version => 2.4.11 GIF Read Support => enabled GIF Create Support => enabled JPEG Support => enabled libJPEG Version => 6b PNG Support => enabled libPNG Version => 1.5.13 WBMP Support => enabled XBM Support => enabled Directive => Local Value => Master Value gd.jpeg_ignore_warning => 1 => 1 hash hash support => enabled Hashing Engines => md2 md4 md5 sha1 sha224 sha256 sha384 sha512/224 sha512/256 sha512 sha3-224 sha3-256 sha3-384 sha3-512 ripemd128 ripemd160 ripemd256 ripemd320 whirlpool tiger128,3 tiger160,3 tiger192,3 tiger128,4 tiger160,4 tiger192,4 snefru snefru256 gost gost-crypto adler32 crc32 crc32b fnv132 fnv1a32 fnv164 fnv1a64 joaat haval128,3 haval160,3 haval192,3 haval224,3 haval256,3 haval128,4 haval160,4 haval192,4 haval224,4 haval256,4 haval128,5 haval160,5 haval192,5 haval224,5 haval256,5 iconv iconv support => enabled iconv implementation => glibc iconv library version => 2.17 Directive => Local Value => Master Value iconv.input_encoding => no value => no value iconv.internal_encoding => no value => no value iconv.output_encoding => no value => no value intl Internationalization support => enabled version => 1.1.0 ICU version => 50.1.2 ICU Data version => 50.1 Directive => Local Value => Master Value intl.default_locale => no value => no value intl.error_level => 0 => 0 intl.use_exceptions => 0 => 0 json json support => enabled json version => 1.5.0 libxml libXML support => active libXML Compiled Version => 2.9.1 libXML Loaded Version => 20901 libXML streams => enabled mbstring Multibyte Support => enabled Multibyte string engine => libmbfl HTTP input encoding translation => disabled libmbfl version => 1.3.2 oniguruma version => 5.9.6 mbstring extension makes use of "streamable kanji code filter and converter", which is distributed under the GNU Lesser General Public License version 2.1. Multibyte (japanese) regex support => enabled Multibyte regex (oniguruma) backtrack check => On Multibyte regex (oniguruma) version => 5.9.6 Directive => Local Value => Master Value mbstring.detect_order => no value => no value mbstring.encoding_translation => Off => Off mbstring.func_overload => 0 => 0 mbstring.http_input => no value => no value mbstring.http_output => no value => no value mbstring.http_output_conv_mimetypes => ^(text/|application/xhtml\+xml) => ^(text/|application/xhtml\+xml) mbstring.internal_encoding => no value => no value mbstring.language => neutral => neutral mbstring.strict_detection => Off => Off mbstring.substitute_character => no value => no value mysqli MysqlI Support => enabled Client API library version => mysqlnd 5.0.12-dev - 20150407 - $Id: b396954eeb2d1d9ed7902b8bae237b287f21ad9e $ Active Persistent Links => 0 Inactive Persistent Links => 0 Active Links => 0 Directive => Local Value => Master Value mysqli.allow_local_infile => On => On mysqli.allow_persistent => On => On mysqli.default_host => no value => no value mysqli.default_port => 3306 => 3306 mysqli.default_pw => no value => no value mysqli.default_socket => /var/lib/mysql/mysql.sock => /var/lib/mysql/mysql.sock mysqli.default_user => no value => no value mysqli.max_links => Unlimited => Unlimited mysqli.max_persistent => Unlimited => Unlimited mysqli.reconnect => Off => Off mysqli.rollback_on_cached_plink => Off => Off mysqlnd mysqlnd => enabled Version => mysqlnd 5.0.12-dev - 20150407 - $Id: b396954eeb2d1d9ed7902b8bae237b287f21ad9e $ Compression => supported core SSL => supported extended SSL => supported Command buffer size => 4096 Read buffer size => 32768 Read timeout => 31536000 Collecting statistics => Yes Collecting memory statistics => No Tracing => n/a Loaded plugins => mysqlnd,debug_trace,auth_plugin_mysql_native_password,auth_plugin_mysql_clear_password,auth_plugin_sha256_password API Extensions => pdo_mysql,mysqli mysqlnd statistics => bytes_sent => 0 bytes_received => 0 packets_sent => 0 packets_received => 0 protocol_overhead_in => 0 protocol_overhead_out => 0 bytes_received_ok_packet => 0 bytes_received_eof_packet => 0 bytes_received_rset_header_packet => 0 bytes_received_rset_field_meta_packet => 0 bytes_received_rset_row_packet => 0 bytes_received_prepare_response_packet => 0 bytes_received_change_user_packet => 0 packets_sent_command => 0 packets_received_ok => 0 packets_received_eof => 0 packets_received_rset_header => 0 packets_received_rset_field_meta => 0 packets_received_rset_row => 0 packets_received_prepare_response => 0 packets_received_change_user => 0 result_set_queries => 0 non_result_set_queries => 0 no_index_used => 0 bad_index_used => 0 slow_queries => 0 buffered_sets => 0 unbuffered_sets => 0 ps_buffered_sets => 0 ps_unbuffered_sets => 0 flushed_normal_sets => 0 flushed_ps_sets => 0 ps_prepared_never_executed => 0 ps_prepared_once_executed => 0 rows_fetched_from_server_normal => 0 rows_fetched_from_server_ps => 0 rows_buffered_from_client_normal => 0 rows_buffered_from_client_ps => 0 rows_fetched_from_client_normal_buffered => 0 rows_fetched_from_client_normal_unbuffered => 0 rows_fetched_from_client_ps_buffered => 0 rows_fetched_from_client_ps_unbuffered => 0 rows_fetched_from_client_ps_cursor => 0 rows_affected_normal => 0 rows_affected_ps => 0 rows_skipped_normal => 0 rows_skipped_ps => 0 copy_on_write_saved => 0 copy_on_write_performed => 0 command_buffer_too_small => 0 connect_success => 0 connect_failure => 0 connection_reused => 0 reconnect => 0 pconnect_success => 0 active_connections => 0 active_persistent_connections => 0 explicit_close => 0 implicit_close => 0 disconnect_close => 0 in_middle_of_command_close => 0 explicit_free_result => 0 implicit_free_result => 0 explicit_stmt_close => 0 implicit_stmt_close => 0 mem_emalloc_count => 0 mem_emalloc_amount => 0 mem_ecalloc_count => 0 mem_ecalloc_amount => 0 mem_erealloc_count => 0 mem_erealloc_amount => 0 mem_efree_count => 0 mem_efree_amount => 0 mem_malloc_count => 0 mem_malloc_amount => 0 mem_calloc_count => 0 mem_calloc_amount => 0 mem_realloc_count => 0 mem_realloc_amount => 0 mem_free_count => 0 mem_free_amount => 0 mem_estrndup_count => 0 mem_strndup_count => 0 mem_estrdup_count => 0 mem_strdup_count => 0 mem_edupl_count => 0 mem_dupl_count => 0 proto_text_fetched_null => 0 proto_text_fetched_bit => 0 proto_text_fetched_tinyint => 0 proto_text_fetched_short => 0 proto_text_fetched_int24 => 0 proto_text_fetched_int => 0 proto_text_fetched_bigint => 0 proto_text_fetched_decimal => 0 proto_text_fetched_float => 0 proto_text_fetched_double => 0 proto_text_fetched_date => 0 proto_text_fetched_year => 0 proto_text_fetched_time => 0 proto_text_fetched_datetime => 0 proto_text_fetched_timestamp => 0 proto_text_fetched_string => 0 proto_text_fetched_blob => 0 proto_text_fetched_enum => 0 proto_text_fetched_set => 0 proto_text_fetched_geometry => 0 proto_text_fetched_other => 0 proto_binary_fetched_null => 0 proto_binary_fetched_bit => 0 proto_binary_fetched_tinyint => 0 proto_binary_fetched_short => 0 proto_binary_fetched_int24 => 0 proto_binary_fetched_int => 0 proto_binary_fetched_bigint => 0 proto_binary_fetched_decimal => 0 proto_binary_fetched_float => 0 proto_binary_fetched_double => 0 proto_binary_fetched_date => 0 proto_binary_fetched_year => 0 proto_binary_fetched_time => 0 proto_binary_fetched_datetime => 0 proto_binary_fetched_timestamp => 0 proto_binary_fetched_string => 0 proto_binary_fetched_json => 0 proto_binary_fetched_blob => 0 proto_binary_fetched_enum => 0 proto_binary_fetched_set => 0 proto_binary_fetched_geometry => 0 proto_binary_fetched_other => 0 init_command_executed_count => 0 init_command_failed_count => 0 com_quit => 0 com_init_db => 0 com_query => 0 com_field_list => 0 com_create_db => 0 com_drop_db => 0 com_refresh => 0 com_shutdown => 0 com_statistics => 0 com_process_info => 0 com_connect => 0 com_process_kill => 0 com_debug => 0 com_ping => 0 com_time => 0 com_delayed_insert => 0 com_change_user => 0 com_binlog_dump => 0 com_table_dump => 0 com_connect_out => 0 com_register_slave => 0 com_stmt_prepare => 0 com_stmt_execute => 0 com_stmt_send_long_data => 0 com_stmt_close => 0 com_stmt_reset => 0 com_stmt_set_option => 0 com_stmt_fetch => 0 com_deamon => 0 bytes_received_real_data_normal => 0 bytes_received_real_data_ps => 0 openssl OpenSSL support => enabled OpenSSL Library Version => OpenSSL 1.0.1e-fips 11 Feb 2013 OpenSSL Header Version => OpenSSL 1.0.1e-fips 11 Feb 2013 Openssl default config => /etc/pki/tls/openssl.cnf Directive => Local Value => Master Value openssl.cafile => no value => no value openssl.capath => no value => no value pcre PCRE (Perl Compatible Regular Expressions) Support => enabled PCRE Library Version => 8.38 2015-11-23 PCRE JIT Support => enabled Directive => Local Value => Master Value pcre.backtrack_limit => 1000000 => 1000000 pcre.jit => 1 => 1 pcre.recursion_limit => 100000 => 100000 PDO PDO support => enabled PDO drivers => sqlite, mysql pdo_mysql PDO Driver for MySQL => enabled Client API version => mysqlnd 5.0.12-dev - 20150407 - $Id: b396954eeb2d1d9ed7902b8bae237b287f21ad9e $ Directive => Local Value => Master Value pdo_mysql.default_socket => /var/lib/mysql/mysql.sock => /var/lib/mysql/mysql.sock pdo_sqlite PDO Driver for SQLite 3.x => enabled SQLite Library => 3.15.1 Phar Phar: PHP Archive support => enabled Phar EXT version => 2.0.2 Phar API version => 1.1.1 SVN revision => $Id: 59c11f4e29768bfbbf6f41cb469abd81d8655850 $ Phar-based phar archives => enabled Tar-based phar archives => enabled ZIP-based phar archives => enabled gzip compression => enabled bzip2 compression => enabled OpenSSL support => enabled Phar based on pear/PHP_Archive, original concept by Davey Shafik. Phar fully realized by Gregory Beaver and Marcus Boerger. Portions of tar implementation Copyright (c) 2003-2009 Tim Kientzle. Directive => Local Value => Master Value phar.cache_list => no value => no value phar.readonly => On => On phar.require_hash => On => On posix Revision => $Id: b691ca925e7a085e6929579c4eba8fed0732e0ef $ Reflection Reflection => enabled Version => $Id: a06522d025b0af3e6ba10a0f6964086b7e6f5458 $ session Session Support => enabled Registered save handlers => files user Registered serializer handlers => php_serialize php php_binary Directive => Local Value => Master Value session.auto_start => Off => Off session.cache_expire => 180 => 180 session.cache_limiter => nocache => nocache session.cookie_domain => no value => no value session.cookie_httponly => Off => Off session.cookie_lifetime => 0 => 0 session.cookie_path => / => / session.cookie_secure => Off => Off session.gc_divisor => 100 => 100 session.gc_maxlifetime => 1440 => 1440 session.gc_probability => 1 => 1 session.lazy_write => On => On session.name => PHPSESSID => PHPSESSID session.referer_check => no value => no value session.save_handler => files => files session.save_path => no value => no value session.serialize_handler => php => php session.sid_bits_per_character => 4 => 4 session.sid_length => 32 => 32 session.upload_progress.cleanup => On => On session.upload_progress.enabled => On => On session.upload_progress.freq => 1% => 1% session.upload_progress.min_freq => 1 => 1 session.upload_progress.name => PHP_SESSION_UPLOAD_PROGRESS => PHP_SESSION_UPLOAD_PROGRESS session.upload_progress.prefix => upload_progress_ => upload_progress_ session.use_cookies => On => On session.use_only_cookies => On => On session.use_strict_mode => Off => Off session.use_trans_sid => 0 => 0 SimpleXML Simplexml support => enabled Revision => $Id: 7e5516dcdf2fe6ded7970eaeb6abd8d07df39a2a $ Schema support => enabled SPL SPL support => enabled Interfaces => Countable, OuterIterator, RecursiveIterator, SeekableIterator, SplObserver, SplSubject Classes => AppendIterator, ArrayIterator, ArrayObject, BadFunctionCallException, BadMethodCallException, CachingIterator, CallbackFilterIterator, DirectoryIterator, DomainException, EmptyIterator, FilesystemIterator, FilterIterator, GlobIterator, InfiniteIterator, InvalidArgumentException, IteratorIterator, LengthException, LimitIterator, LogicException, MultipleIterator, NoRewindIterator, OutOfBoundsException, OutOfRangeException, OverflowException, ParentIterator, RangeException, RecursiveArrayIterator, RecursiveCachingIterator, RecursiveCallbackFilterIterator, RecursiveDirectoryIterator, RecursiveFilterIterator, RecursiveIteratorIterator, RecursiveRegexIterator, RecursiveTreeIterator, RegexIterator, RuntimeException, SplDoublyLinkedList, SplFileInfo, SplFileObject, SplFixedArray, SplHeap, SplMinHeap, SplMaxHeap, SplObjectStorage, SplPriorityQueue, SplQueue, SplStack, SplTempFileObject, UnderflowException, UnexpectedValueException sqlite3 SQLite3 support => enabled SQLite3 module version => 0.7-dev SQLite Library => 3.15.1 Directive => Local Value => Master Value sqlite3.extension_dir => no value => no value standard Dynamic Library Support => enabled Path to sendmail => /usr/sbin/sendmail -t -i Directive => Local Value => Master Value assert.active => 1 => 1 assert.bail => 0 => 0 assert.callback => no value => no value assert.exception => 0 => 0 assert.quiet_eval => 0 => 0 assert.warning => 1 => 1 auto_detect_line_endings => 0 => 0 default_socket_timeout => 60 => 60 from => no value => no value session.trans_sid_hosts => no value => no value session.trans_sid_tags => a=href,area=href,frame=src,form= => a=href,area=href,frame=src,form= url_rewriter.hosts => no value => no value url_rewriter.tags => form= => form= user_agent => no value => no value tokenizer Tokenizer Support => enabled xml XML Support => active XML Namespace Support => active libxml2 Version => 2.9.1 xmlreader XMLReader => enabled xmlwriter XMLWriter => enabled zip Zip => enabled Zip version => 1.13.5 Libzip version => 1.1.2 zlib ZLib Support => enabled Stream Wrapper => compress.zlib:// Stream Filter => zlib.inflate, zlib.deflate Compiled Version => 1.2.7 Linked Version => 1.2.7 Directive => Local Value => Master Value zlib.output_compression => Off => Off zlib.output_compression_level => -1 => -1 zlib.output_handler => no value => no value Additional Modules Module Name Environment Variable => Value MANPATH => : XDG_SESSION_ID => 5843 HOSTNAME => kw14934.cbrc.kaust.edu.sa TEST_PHP_SRCDIR => /local/apps/src/php/php-7.1.6 SELINUX_ROLE_REQUESTED => SHELL => /bin/bash TERM => xterm CATALINA_HOME => /local/apps/ASF/tomcat/apache-tomcat-8.0.20 MAKEFLAGS => HISTSIZE => 1000 SSH_CLIENT => deleted TEST_PHPDBG_EXECUTABLE => /local/data/apps/src/php/php-7.1.6/sapi/phpdbg/phpdbg SELINUX_USE_CURRENT_RANGE => KAUST_ARCH => x86_64 OLDPWD => /local/apps/src/php/php-7.1.6 QTDIR => /usr/lib64/qt-3.3 QTINC => /usr/lib64/qt-3.3/include SSH_TTY => deleted ANT_HOME => /local/apps/ASF/ant/apache-ant-1.9.4 QT_GRAPHICSSYSTEM_CHECKED => 1 JAVA_OPTS => -Xms4m -Xmx1024m USER => aaron LS_COLORS => rs=0:di=01;34:ln=01;36:mh=00:pi=40;33:so=01;35:do=01;35:bd=40;33;01:cd=40;33;01:or=40;31;01:mi=01;05;37;41:su=37;41:sg=30;43:ca=30;41:tw=30;42:ow=34;42:st=37;44:ex=01;32:*.tar=01;31:*.tgz=01;31:*.arc=01;31:*.arj=01;31:*.taz=01;31:*.lha=01;31:*.lz4=01;31:*.lzh=01;31:*.lzma=01;31:*.tlz=01;31:*.txz=01;31:*.tzo=01;31:*.t7z=01;31:*.zip=01;31:*.z=01;31:*.Z=01;31:*.dz=01;31:*.gz=01;31:*.lrz=01;31:*.lz=01;31:*.lzo=01;31:*.xz=01;31:*.bz2=01;31:*.bz=01;31:*.tbz=01;31:*.tbz2=01;31:*.tz=01;31:*.deb=01;31:*.rpm=01;31:*.jar=01;31:*.war=01;31:*.ear=01;31:*.sar=01;31:*.rar=01;31:*.alz=01;31:*.ace=01;31:*.zoo=01;31:*.cpio=01;31:*.7z=01;31:*.rz=01;31:*.cab=01;31:*.jpg=01;35:*.jpeg=01;35:*.gif=01;35:*.bmp=01;35:*.pbm=01;35:*.pgm=01;35:*.ppm=01;35:*.tga=01;35:*.xbm=01;35:*.xpm=01;35:*.tif=01;35:*.tiff=01;35:*.png=01;35:*.svg=01;35:*.svgz=01;35:*.mng=01;35:*.pcx=01;35:*.mov=01;35:*.mpg=01;35:*.mpeg=01;35:*.m2v=01;35:*.mkv=01;35:*.webm=01;35:*.ogm=01;35:*.mp4=01;35:*.m4v=01;35:*.mp4v=01;35:*.vob=01;35:*.qt=01;35:*.nuv=01;35:*.wmv=01;35:*.asf=01;35:*.rm=01;35:*.rmvb=01;35:*.flc=01;35:*.avi=01;35:*.fli=01;35:*.flv=01;35:*.gl=01;35:*.dl=01;35:*.xcf=01;35:*.xwd=01;35:*.yuv=01;35:*.cgm=01;35:*.emf=01;35:*.axv=01;35:*.anx=01;35:*.ogv=01;35:*.ogx=01;35:*.aac=01;36:*.au=01;36:*.flac=01;36:*.mid=01;36:*.midi=01;36:*.mka=01;36:*.mp3=01;36:*.mpc=01;36:*.ogg=01;36:*.ra=01;36:*.wav=01;36:*.axa=01;36:*.oga=01;36:*.spx=01;36:*.xspf=01;36: SSH_AUTH_SOCK => deleted KAUST_DISTRO => el6 MAKELEVEL => 1 MFLAGS => PATH => /usr/lib64/qt-3.3/bin:/apps/mongodb/3.4.1/bin:/usr/local/bin:/usr/bin:/usr/local/sbin:/usr/sbin:/home/aaron/.local/bin:/home/aaron/bin MAIL => /var/spool/mail/aaron LIBGL_ALWAYS_INDIRECT => 1 KAUST_APPS_ROOT => /cbrc/software PWD => /local/data/apps/src/php/php-7.1.6 XMODIFIERS => @im=none JAVA_HOME => /local/apps/java/jdk/jdk1.8.0_102 LANG => en_US.UTF-8 TEST_PHP_EXECUTABLE => /local/apps/src/php/php-7.1.6/sapi/cli/php MODULEPATH => /cbrc/modules/applications:/cbrc/modules/compilers:/cbrc/modules/libs:/cbrc/modules/sets KDEDIRS => /usr LOADEDMODULES => SELINUX_LEVEL_REQUESTED => KAUST_MODULES_ROOT => /cbrc/modules HISTCONTROL => ignoredups SSH_ASKPASS => /usr/libexec/openssh/gnome-ssh-askpass HOME => /home/aaron SHLVL => 3 LANGUAGE => LOGNAME => aaron QTLIB => /usr/lib64/qt-3.3/lib CVS_RSH => ssh SSH_CONNECTION => deleted MODULESHOME => /usr/share/Modules LESSOPEN => ||/usr/bin/lesspipe.sh %s XDG_RUNTIME_DIR => /run/user/1001 DISPLAY => localhost:12.0 CC => /local/apps/src/php/php-7.1.6/meta_ccld QT_PLUGIN_PATH => /usr/lib64/kde4/plugins:/usr/lib/kde4/plugins BASH_FUNC_module() => () { eval `LD_PRELOAD=/usr/lib64/libtcl8.5.so /usr/bin/modulecmd bash $*` } _ => /local/apps/src/php/php-7.1.6/sapi/cli/php PHP Variables Variable => Value $_SERVER['MANPATH'] => : $_SERVER['XDG_SESSION_ID'] => 5843 $_SERVER['HOSTNAME'] => kw14934.cbrc.kaust.edu.sa $_SERVER['TEST_PHP_SRCDIR'] => /local/apps/src/php/php-7.1.6 $_SERVER['SELINUX_ROLE_REQUESTED'] => $_SERVER['SHELL'] => /bin/bash $_SERVER['TERM'] => xterm $_SERVER['CATALINA_HOME'] => /local/apps/ASF/tomcat/apache-tomcat-8.0.20 $_SERVER['MAKEFLAGS'] => $_SERVER['HISTSIZE'] => 1000 $_SERVER['SSH_CLIENT'] => deleted $_SERVER['TEST_PHPDBG_EXECUTABLE'] => /local/data/apps/src/php/php-7.1.6/sapi/phpdbg/phpdbg $_SERVER['SELINUX_USE_CURRENT_RANGE'] => $_SERVER['KAUST_ARCH'] => x86_64 $_SERVER['OLDPWD'] => /local/apps/src/php/php-7.1.6 $_SERVER['QTDIR'] => /usr/lib64/qt-3.3 $_SERVER['QTINC'] => /usr/lib64/qt-3.3/include $_SERVER['SSH_TTY'] => deleted $_SERVER['ANT_HOME'] => /local/apps/ASF/ant/apache-ant-1.9.4 $_SERVER['QT_GRAPHICSSYSTEM_CHECKED'] => 1 $_SERVER['JAVA_OPTS'] => -Xms4m -Xmx1024m $_SERVER['USER'] => aaron $_SERVER['LS_COLORS'] => rs=0:di=01;34:ln=01;36:mh=00:pi=40;33:so=01;35:do=01;35:bd=40;33;01:cd=40;33;01:or=40;31;01:mi=01;05;37;41:su=37;41:sg=30;43:ca=30;41:tw=30;42:ow=34;42:st=37;44:ex=01;32:*.tar=01;31:*.tgz=01;31:*.arc=01;31:*.arj=01;31:*.taz=01;31:*.lha=01;31:*.lz4=01;31:*.lzh=01;31:*.lzma=01;31:*.tlz=01;31:*.txz=01;31:*.tzo=01;31:*.t7z=01;31:*.zip=01;31:*.z=01;31:*.Z=01;31:*.dz=01;31:*.gz=01;31:*.lrz=01;31:*.lz=01;31:*.lzo=01;31:*.xz=01;31:*.bz2=01;31:*.bz=01;31:*.tbz=01;31:*.tbz2=01;31:*.tz=01;31:*.deb=01;31:*.rpm=01;31:*.jar=01;31:*.war=01;31:*.ear=01;31:*.sar=01;31:*.rar=01;31:*.alz=01;31:*.ace=01;31:*.zoo=01;31:*.cpio=01;31:*.7z=01;31:*.rz=01;31:*.cab=01;31:*.jpg=01;35:*.jpeg=01;35:*.gif=01;35:*.bmp=01;35:*.pbm=01;35:*.pgm=01;35:*.ppm=01;35:*.tga=01;35:*.xbm=01;35:*.xpm=01;35:*.tif=01;35:*.tiff=01;35:*.png=01;35:*.svg=01;35:*.svgz=01;35:*.mng=01;35:*.pcx=01;35:*.mov=01;35:*.mpg=01;35:*.mpeg=01;35:*.m2v=01;35:*.mkv=01;35:*.webm=01;35:*.ogm=01;35:*.mp4=01;35:*.m4v=01;35:*.mp4v=01;35:*.vob=01;35:*.qt=01;35:*.nuv=01;35:*.wmv=01;35:*.asf=01;35:*.rm=01;35:*.rmvb=01;35:*.flc=01;35:*.avi=01;35:*.fli=01;35:*.flv=01;35:*.gl=01;35:*.dl=01;35:*.xcf=01;35:*.xwd=01;35:*.yuv=01;35:*.cgm=01;35:*.emf=01;35:*.axv=01;35:*.anx=01;35:*.ogv=01;35:*.ogx=01;35:*.aac=01;36:*.au=01;36:*.flac=01;36:*.mid=01;36:*.midi=01;36:*.mka=01;36:*.mp3=01;36:*.mpc=01;36:*.ogg=01;36:*.ra=01;36:*.wav=01;36:*.axa=01;36:*.oga=01;36:*.spx=01;36:*.xspf=01;36: $_SERVER['SSH_AUTH_SOCK'] => deleted $_SERVER['KAUST_DISTRO'] => el6 $_SERVER['MAKELEVEL'] => 1 $_SERVER['MFLAGS'] => $_SERVER['PATH'] => /usr/lib64/qt-3.3/bin:/apps/mongodb/3.4.1/bin:/usr/local/bin:/usr/bin:/usr/local/sbin:/usr/sbin:/home/aaron/.local/bin:/home/aaron/bin $_SERVER['MAIL'] => /var/spool/mail/aaron $_SERVER['LIBGL_ALWAYS_INDIRECT'] => 1 $_SERVER['KAUST_APPS_ROOT'] => /cbrc/software $_SERVER['PWD'] => /local/data/apps/src/php/php-7.1.6 $_SERVER['XMODIFIERS'] => @im=none $_SERVER['JAVA_HOME'] => /local/apps/java/jdk/jdk1.8.0_102 $_SERVER['LANG'] => en_US.UTF-8 $_SERVER['TEST_PHP_EXECUTABLE'] => /local/apps/src/php/php-7.1.6/sapi/cli/php $_SERVER['MODULEPATH'] => /cbrc/modules/applications:/cbrc/modules/compilers:/cbrc/modules/libs:/cbrc/modules/sets $_SERVER['KDEDIRS'] => /usr $_SERVER['LOADEDMODULES'] => $_SERVER['SELINUX_LEVEL_REQUESTED'] => $_SERVER['KAUST_MODULES_ROOT'] => /cbrc/modules $_SERVER['HISTCONTROL'] => ignoredups $_SERVER['SSH_ASKPASS'] => /usr/libexec/openssh/gnome-ssh-askpass $_SERVER['HOME'] => /home/aaron $_SERVER['SHLVL'] => 3 $_SERVER['LANGUAGE'] => $_SERVER['LOGNAME'] => aaron $_SERVER['QTLIB'] => /usr/lib64/qt-3.3/lib $_SERVER['CVS_RSH'] => ssh $_SERVER['SSH_CONNECTION'] => deleted $_SERVER['MODULESHOME'] => /usr/share/Modules $_SERVER['LESSOPEN'] => ||/usr/bin/lesspipe.sh %s $_SERVER['XDG_RUNTIME_DIR'] => /run/user/1001 $_SERVER['DISPLAY'] => localhost:12.0 $_SERVER['CC'] => /local/apps/src/php/php-7.1.6/meta_ccld $_SERVER['QT_PLUGIN_PATH'] => /usr/lib64/kde4/plugins:/usr/lib/kde4/plugins $_SERVER['BASH_FUNC_module()'] => () { eval `LD_PRELOAD=/usr/lib64/libtcl8.5.so /usr/bin/modulecmd bash $*` } $_SERVER['_'] => /local/apps/src/php/php-7.1.6/sapi/cli/php $_SERVER['PHP_SELF'] => $_SERVER['SCRIPT_NAME'] => $_SERVER['SCRIPT_FILENAME'] => $_SERVER['PATH_TRANSLATED'] => $_SERVER['DOCUMENT_ROOT'] => $_SERVER['REQUEST_TIME_FLOAT'] => 1497454183.1154 $_SERVER['REQUEST_TIME'] => 1497454183 $_SERVER['argv'] => Array ( ) $_SERVER['argc'] => 0 $_ENV['MANPATH'] => : $_ENV['XDG_SESSION_ID'] => 5843 $_ENV['HOSTNAME'] => kw14934.cbrc.kaust.edu.sa $_ENV['TEST_PHP_SRCDIR'] => /local/apps/src/php/php-7.1.6 $_ENV['SELINUX_ROLE_REQUESTED'] => $_ENV['SHELL'] => /bin/bash $_ENV['TERM'] => xterm $_ENV['CATALINA_HOME'] => /local/apps/ASF/tomcat/apache-tomcat-8.0.20 $_ENV['MAKEFLAGS'] => $_ENV['HISTSIZE'] => 1000 $_ENV['SSH_CLIENT'] => deleted $_ENV['TEST_PHPDBG_EXECUTABLE'] => /local/data/apps/src/php/php-7.1.6/sapi/phpdbg/phpdbg $_ENV['SELINUX_USE_CURRENT_RANGE'] => $_ENV['KAUST_ARCH'] => x86_64 $_ENV['OLDPWD'] => /local/apps/src/php/php-7.1.6 $_ENV['QTDIR'] => /usr/lib64/qt-3.3 $_ENV['QTINC'] => /usr/lib64/qt-3.3/include $_ENV['SSH_TTY'] => deleted $_ENV['ANT_HOME'] => /local/apps/ASF/ant/apache-ant-1.9.4 $_ENV['QT_GRAPHICSSYSTEM_CHECKED'] => 1 $_ENV['JAVA_OPTS'] => -Xms4m -Xmx1024m $_ENV['USER'] => aaron $_ENV['LS_COLORS'] => rs=0:di=01;34:ln=01;36:mh=00:pi=40;33:so=01;35:do=01;35:bd=40;33;01:cd=40;33;01:or=40;31;01:mi=01;05;37;41:su=37;41:sg=30;43:ca=30;41:tw=30;42:ow=34;42:st=37;44:ex=01;32:*.tar=01;31:*.tgz=01;31:*.arc=01;31:*.arj=01;31:*.taz=01;31:*.lha=01;31:*.lz4=01;31:*.lzh=01;31:*.lzma=01;31:*.tlz=01;31:*.txz=01;31:*.tzo=01;31:*.t7z=01;31:*.zip=01;31:*.z=01;31:*.Z=01;31:*.dz=01;31:*.gz=01;31:*.lrz=01;31:*.lz=01;31:*.lzo=01;31:*.xz=01;31:*.bz2=01;31:*.bz=01;31:*.tbz=01;31:*.tbz2=01;31:*.tz=01;31:*.deb=01;31:*.rpm=01;31:*.jar=01;31:*.war=01;31:*.ear=01;31:*.sar=01;31:*.rar=01;31:*.alz=01;31:*.ace=01;31:*.zoo=01;31:*.cpio=01;31:*.7z=01;31:*.rz=01;31:*.cab=01;31:*.jpg=01;35:*.jpeg=01;35:*.gif=01;35:*.bmp=01;35:*.pbm=01;35:*.pgm=01;35:*.ppm=01;35:*.tga=01;35:*.xbm=01;35:*.xpm=01;35:*.tif=01;35:*.tiff=01;35:*.png=01;35:*.svg=01;35:*.svgz=01;35:*.mng=01;35:*.pcx=01;35:*.mov=01;35:*.mpg=01;35:*.mpeg=01;35:*.m2v=01;35:*.mkv=01;35:*.webm=01;35:*.ogm=01;35:*.mp4=01;35:*.m4v=01;35:*.mp4v=01;35:*.vob=01;35:*.qt=01;35:*.nuv=01;35:*.wmv=01;35:*.asf=01;35:*.rm=01;35:*.rmvb=01;35:*.flc=01;35:*.avi=01;35:*.fli=01;35:*.flv=01;35:*.gl=01;35:*.dl=01;35:*.xcf=01;35:*.xwd=01;35:*.yuv=01;35:*.cgm=01;35:*.emf=01;35:*.axv=01;35:*.anx=01;35:*.ogv=01;35:*.ogx=01;35:*.aac=01;36:*.au=01;36:*.flac=01;36:*.mid=01;36:*.midi=01;36:*.mka=01;36:*.mp3=01;36:*.mpc=01;36:*.ogg=01;36:*.ra=01;36:*.wav=01;36:*.axa=01;36:*.oga=01;36:*.spx=01;36:*.xspf=01;36: $_ENV['SSH_AUTH_SOCK'] => deleted $_ENV['KAUST_DISTRO'] => el6 $_ENV['MAKELEVEL'] => 1 $_ENV['MFLAGS'] => $_ENV['PATH'] => /usr/lib64/qt-3.3/bin:/apps/mongodb/3.4.1/bin:/usr/local/bin:/usr/bin:/usr/local/sbin:/usr/sbin:/home/aaron/.local/bin:/home/aaron/bin $_ENV['MAIL'] => /var/spool/mail/aaron $_ENV['LIBGL_ALWAYS_INDIRECT'] => 1 $_ENV['KAUST_APPS_ROOT'] => /cbrc/software $_ENV['PWD'] => /local/data/apps/src/php/php-7.1.6 $_ENV['XMODIFIERS'] => @im=none $_ENV['JAVA_HOME'] => /local/apps/java/jdk/jdk1.8.0_102 $_ENV['LANG'] => en_US.UTF-8 $_ENV['TEST_PHP_EXECUTABLE'] => /local/apps/src/php/php-7.1.6/sapi/cli/php $_ENV['MODULEPATH'] => /cbrc/modules/applications:/cbrc/modules/compilers:/cbrc/modules/libs:/cbrc/modules/sets $_ENV['KDEDIRS'] => /usr $_ENV['LOADEDMODULES'] => $_ENV['SELINUX_LEVEL_REQUESTED'] => $_ENV['KAUST_MODULES_ROOT'] => /cbrc/modules $_ENV['HISTCONTROL'] => ignoredups $_ENV['SSH_ASKPASS'] => /usr/libexec/openssh/gnome-ssh-askpass $_ENV['HOME'] => /home/aaron $_ENV['SHLVL'] => 3 $_ENV['LANGUAGE'] => $_ENV['LOGNAME'] => aaron $_ENV['QTLIB'] => /usr/lib64/qt-3.3/lib $_ENV['CVS_RSH'] => ssh $_ENV['SSH_CONNECTION'] => deleted $_ENV['MODULESHOME'] => /usr/share/Modules $_ENV['LESSOPEN'] => ||/usr/bin/lesspipe.sh %s $_ENV['XDG_RUNTIME_DIR'] => /run/user/1001 $_ENV['DISPLAY'] => localhost:12.0 $_ENV['CC'] => /local/apps/src/php/php-7.1.6/meta_ccld $_ENV['QT_PLUGIN_PATH'] => /usr/lib64/kde4/plugins:/usr/lib/kde4/plugins $_ENV['BASH_FUNC_module()'] => () { eval `LD_PRELOAD=/usr/lib64/libtcl8.5.so /usr/bin/modulecmd bash $*` } $_ENV['_'] => /local/apps/src/php/php-7.1.6/sapi/cli/php PHP License This program is free software; you can redistribute it and/or modify it under the terms of the PHP License as published by the PHP Group and included in the distribution in the file: LICENSE This program is distributed in the hope that it will be useful, but WITHOUT ANY WARRANTY; without even the implied warranty of MERCHANTABILITY or FITNESS FOR A PARTICULAR PURPOSE. If you did not receive a copy of the PHP license, or have any questions about PHP licensing, please contact license@php.net.