PHP 7.1.7 FAILED TEST SUMMARY REPORT

From: Date: Wed, 26 Jul 2017 14:51:24 +0000
Subject: PHP 7.1.7 FAILED TEST SUMMARY REPORT
Groups: php.qa.reports 
Request: Send a blank email to php-qa-reports+get-33974@lists.php.net to get a copy of this message
See attached report -- *Peggy Bauer* CAO Production Support 214-770-1782

===================================================================== EXPECTED FAILED TEST SUMMARY --------------------------------------------------------------------- Test open_basedir configuration [tests/security/open_basedir_linkinfo.phpt] XFAIL REASON: BUG: open_basedir cannot delete symlink to prohibited file. See also bugs 48111 and 52176. Inconsistencies when accessing protected members [Zend/tests/access_modifiers_008.phpt] XFAIL REASON: Discussion: http://marc.info/?l=php-internals&m=120221184420957&w=2 Inconsistencies when accessing protected members - 2 [Zend/tests/access_modifiers_009.phpt] XFAIL REASON: Discussion: http://marc.info/?l=php-internals&m=120221184420957&w=2 Bug #48770 (call_user_func_array() fails to call parent from inheriting class) [Zend/tests/bug48770.phpt] XFAIL REASON: See Bug #48770 Bug #48770 (call_user_func_array() fails to call parent from inheriting class) [Zend/tests/bug48770_2.phpt] XFAIL REASON: See Bug #48770 Bug #48770 (call_user_func_array() fails to call parent from inheriting class) [Zend/tests/bug48770_3.phpt] XFAIL REASON: See Bug #48770 Initial value of static var in method depends on the include time of the class definition [Zend/tests/method_static_var.phpt] XFAIL REASON: Maybe not a bug DateTime::add() -- fall type2 type3 [ext/date/tests/DateTime_add-fall-type2-type3.phpt] XFAIL REASON: Various bugs exist DateTime::add() -- fall type3 type2 [ext/date/tests/DateTime_add-fall-type3-type2.phpt] XFAIL REASON: Various bugs exist DateTime::add() -- fall type3 type3 [ext/date/tests/DateTime_add-fall-type3-type3.phpt] XFAIL REASON: Various bugs exist DateTime::add() -- spring type2 type3 [ext/date/tests/DateTime_add-spring-type2-type3.phpt] XFAIL REASON: Various bugs exist DateTime::add() -- spring type3 type2 [ext/date/tests/DateTime_add-spring-type3-type2.phpt] XFAIL REASON: Various bugs exist DateTime::add() -- spring type3 type3 [ext/date/tests/DateTime_add-spring-type3-type3.phpt] XFAIL REASON: Various bugs exist DateTime::diff() -- fall type2 type3 [ext/date/tests/DateTime_diff-fall-type2-type3.phpt] XFAIL REASON: Various bugs exist DateTime::diff() -- fall type3 type2 [ext/date/tests/DateTime_diff-fall-type3-type2.phpt] XFAIL REASON: Various bugs exist DateTime::diff() -- fall type3 type3 [ext/date/tests/DateTime_diff-fall-type3-type3.phpt] XFAIL REASON: Various bugs exist DateTime::diff() -- spring type2 type3 [ext/date/tests/DateTime_diff-spring-type2-type3.phpt] XFAIL REASON: Various bugs exist DateTime::diff() -- spring type3 type2 [ext/date/tests/DateTime_diff-spring-type3-type2.phpt] XFAIL REASON: Various bugs exist DateTime::diff() -- spring type3 type3 [ext/date/tests/DateTime_diff-spring-type3-type3.phpt] XFAIL REASON: Various bugs exist DateTime::sub() -- fall type2 type3 [ext/date/tests/DateTime_sub-fall-type2-type3.phpt] XFAIL REASON: Various bugs exist DateTime::sub() -- fall type3 type2 [ext/date/tests/DateTime_sub-fall-type3-type2.phpt] XFAIL REASON: Various bugs exist DateTime::sub() -- fall type3 type3 [ext/date/tests/DateTime_sub-fall-type3-type3.phpt] XFAIL REASON: Various bugs exist DateTime::sub() -- spring type2 type3 [ext/date/tests/DateTime_sub-spring-type2-type3.phpt] XFAIL REASON: Various bugs exist DateTime::sub() -- spring type3 type2 [ext/date/tests/DateTime_sub-spring-type3-type2.phpt] XFAIL REASON: Various bugs exist DateTime::sub() -- spring type3 type3 [ext/date/tests/DateTime_sub-spring-type3-type3.phpt] XFAIL REASON: Various bugs exist Bug #55407 (Impossible to prototype DateTime::createFromFormat) [ext/date/tests/bug55407.phpt] XFAIL REASON: Bug #55407 RFC: DateTime and Daylight Saving Time Transitions (zone type 3, bd2) [ext/date/tests/rfc-datetime_and_daylight_saving_time-type3-bd2.phpt] XFAIL REASON: Still not quite right RFC: DateTime and Daylight Saving Time Transitions (zone type 3, fs) [ext/date/tests/rfc-datetime_and_daylight_saving_time-type3-fs.phpt] XFAIL REASON: Still not quite right Bug #42718 (unsafe_raw filter not applied when configured as default filter) [ext/filter/tests/bug42718.phpt] XFAIL REASON: FILTER_UNSAFE_RAW not applied when configured as default filter, even with flags Bug #67296 (filter_input doesn't validate variables) [ext/filter/tests/bug49184.phpt] XFAIL REASON: See Bug #49184 Bug #67167: filter_var(null,FILTER_VALIDATE_BOOLEAN,FILTER_NULL_ON_FAILURE) returns null [ext/filter/tests/bug67167.02.phpt] XFAIL REASON: Requires php_zval_filter to not use convert_to_string for all filters. Phar: bug #69958: Segfault in Phar::convertToData on invalid file [ext/phar/tests/bug69958.phpt] XFAIL REASON: Still has memory leaks, see https://bugs.php.net/bug.php?id=70005 updateTimestamp never called when session data is empty [ext/session/tests/bug71162.phpt] XFAIL REASON: Current session module is designed to write empty session always. In addition, current session module only supports SessionHandlerInterface only from PHP 7.0. Bug #70219 Use after free vulnerability in session deserializer [ext/standard/tests/serialize/bug70219.phpt] XFAIL REASON: Unfinished merge, needs fix. Bug #70470 (Built-in server truncates headers spanning over TCP packets) [sapi/cli/tests/bug70470.phpt] XFAIL REASON: bug is not fixed yet FPM: Test status page [sapi/fpm/tests/010.phpt] XFAIL REASON: randomly intermittently failing all the time in CI, with diff: 017+ active processes: 0 018+ total processes: 1 017- active processes: 1 018- total processes: 2 FPM: Test various messages on start, from master and childs [sapi/fpm/tests/015.phpt] XFAIL REASON: randomly intermittently failing all the time in CI, ERROR: unable to read what child say: Bad file descriptor (9) catch_workers_output = yes seems not reliable ===================================================================== ===================================================================== FAILED TEST SUMMARY --------------------------------------------------------------------- Test for DateTime::modify() with absolute time statements [ext/date/tests/date-time-modify-times.phpt] Bug #73594 (dns_get_record() does not populate $additional out parameter - $authns parameter) [ext/standard/tests/network/bug73594a.phpt] bool dns_get_mx ( string $hostname , array &$mxhosts [, array &$weight ] ); [ext/standard/tests/network/dns_get_mx.phpt] gethostbyname() function - basic return valid ip address test [ext/standard/tests/network/gethostbyname_error004.phpt] getmxrr() test [ext/standard/tests/network/getmxrr.phpt] Bug #74090 stream_get_contents maxlength>-1 returns empty string on windows [ext/standard/tests/streams/bug74090.phpt] int stream_socket_sendto ( resource $socket , string $data [, int $flags = 0 [, string $address ]] ); [ext/standard/tests/streams/stream_socket_sendto.phpt] Bug #70436: Use After Free Vulnerability in unserialize() [ext/standard/tests/strings/bug70436.phpt] Bug #72663: Create an Unexpected Object and Don't Invoke __wakeup() in Deserialization [ext/standard/tests/strings/bug72663_3.phpt] FPM: Startup and connect [sapi/fpm/tests/002.phpt] FPM: Test Unix Domain Socket [sapi/fpm/tests/009.phpt] FPM: Test IPv4 all addresses (bug #68420) [sapi/fpm/tests/011.phpt] FPM: Test reload configuration (bug #68442) [sapi/fpm/tests/012.phpt] FPM: Test for log_level in fpm_unix_init_main #68381 [sapi/fpm/tests/013.phpt] FPM: Test for pm.start_servers default calculation message being a notice and not a warning #68458 [sapi/fpm/tests/014.phpt] FPM: Test fastcgi_finish_request function [sapi/fpm/tests/017.phpt] FPM: Test global prefix [sapi/fpm/tests/019.phpt] FPM: Test pool prefix [sapi/fpm/tests/020.phpt] FPM: HTTP_PROXY - CVE-2016-5385 [sapi/fpm/tests/022-cve-2016-5385.phpt] ===================================================================== ===================================================================== TEST RESULT SUMMARY --------------------------------------------------------------------- Exts skipped : 48 Exts tested : 26 --------------------------------------------------------------------- Number of tests : 15404 10273 Tests skipped : 5131 ( 33.3%) -------- Tests warned : 0 ( 0.0%) ( 0.0%) Tests failed : 19 ( 0.1%) ( 0.2%) Expected fail : 37 ( 0.2%) ( 0.4%) Tests passed : 10217 ( 66.3%) ( 99.5%) --------------------------------------------------------------------- Time taken : 382 seconds ===================================================================== ===================================================================== EXPECTED FAILED TEST SUMMARY --------------------------------------------------------------------- Test open_basedir configuration [tests/security/open_basedir_linkinfo.phpt] XFAIL REASON: BUG: open_basedir cannot delete symlink to prohibited file. See also bugs 48111 and 52176. Inconsistencies when accessing protected members [Zend/tests/access_modifiers_008.phpt] XFAIL REASON: Discussion: http://marc.info/?l=php-internals&m=120221184420957&w=2 Inconsistencies when accessing protected members - 2 [Zend/tests/access_modifiers_009.phpt] XFAIL REASON: Discussion: http://marc.info/?l=php-internals&m=120221184420957&w=2 Bug #48770 (call_user_func_array() fails to call parent from inheriting class) [Zend/tests/bug48770.phpt] XFAIL REASON: See Bug #48770 Bug #48770 (call_user_func_array() fails to call parent from inheriting class) [Zend/tests/bug48770_2.phpt] XFAIL REASON: See Bug #48770 Bug #48770 (call_user_func_array() fails to call parent from inheriting class) [Zend/tests/bug48770_3.phpt] XFAIL REASON: See Bug #48770 Initial value of static var in method depends on the include time of the class definition [Zend/tests/method_static_var.phpt] XFAIL REASON: Maybe not a bug DateTime::add() -- fall type2 type3 [ext/date/tests/DateTime_add-fall-type2-type3.phpt] XFAIL REASON: Various bugs exist DateTime::add() -- fall type3 type2 [ext/date/tests/DateTime_add-fall-type3-type2.phpt] XFAIL REASON: Various bugs exist DateTime::add() -- fall type3 type3 [ext/date/tests/DateTime_add-fall-type3-type3.phpt] XFAIL REASON: Various bugs exist DateTime::add() -- spring type2 type3 [ext/date/tests/DateTime_add-spring-type2-type3.phpt] XFAIL REASON: Various bugs exist DateTime::add() -- spring type3 type2 [ext/date/tests/DateTime_add-spring-type3-type2.phpt] XFAIL REASON: Various bugs exist DateTime::add() -- spring type3 type3 [ext/date/tests/DateTime_add-spring-type3-type3.phpt] XFAIL REASON: Various bugs exist DateTime::diff() -- fall type2 type3 [ext/date/tests/DateTime_diff-fall-type2-type3.phpt] XFAIL REASON: Various bugs exist DateTime::diff() -- fall type3 type2 [ext/date/tests/DateTime_diff-fall-type3-type2.phpt] XFAIL REASON: Various bugs exist DateTime::diff() -- fall type3 type3 [ext/date/tests/DateTime_diff-fall-type3-type3.phpt] XFAIL REASON: Various bugs exist DateTime::diff() -- spring type2 type3 [ext/date/tests/DateTime_diff-spring-type2-type3.phpt] XFAIL REASON: Various bugs exist DateTime::diff() -- spring type3 type2 [ext/date/tests/DateTime_diff-spring-type3-type2.phpt] XFAIL REASON: Various bugs exist DateTime::diff() -- spring type3 type3 [ext/date/tests/DateTime_diff-spring-type3-type3.phpt] XFAIL REASON: Various bugs exist DateTime::sub() -- fall type2 type3 [ext/date/tests/DateTime_sub-fall-type2-type3.phpt] XFAIL REASON: Various bugs exist DateTime::sub() -- fall type3 type2 [ext/date/tests/DateTime_sub-fall-type3-type2.phpt] XFAIL REASON: Various bugs exist DateTime::sub() -- fall type3 type3 [ext/date/tests/DateTime_sub-fall-type3-type3.phpt] XFAIL REASON: Various bugs exist DateTime::sub() -- spring type2 type3 [ext/date/tests/DateTime_sub-spring-type2-type3.phpt] XFAIL REASON: Various bugs exist DateTime::sub() -- spring type3 type2 [ext/date/tests/DateTime_sub-spring-type3-type2.phpt] XFAIL REASON: Various bugs exist DateTime::sub() -- spring type3 type3 [ext/date/tests/DateTime_sub-spring-type3-type3.phpt] XFAIL REASON: Various bugs exist Bug #55407 (Impossible to prototype DateTime::createFromFormat) [ext/date/tests/bug55407.phpt] XFAIL REASON: Bug #55407 RFC: DateTime and Daylight Saving Time Transitions (zone type 3, bd2) [ext/date/tests/rfc-datetime_and_daylight_saving_time-type3-bd2.phpt] XFAIL REASON: Still not quite right RFC: DateTime and Daylight Saving Time Transitions (zone type 3, fs) [ext/date/tests/rfc-datetime_and_daylight_saving_time-type3-fs.phpt] XFAIL REASON: Still not quite right Bug #42718 (unsafe_raw filter not applied when configured as default filter) [ext/filter/tests/bug42718.phpt] XFAIL REASON: FILTER_UNSAFE_RAW not applied when configured as default filter, even with flags Bug #67296 (filter_input doesn't validate variables) [ext/filter/tests/bug49184.phpt] XFAIL REASON: See Bug #49184 Bug #67167: filter_var(null,FILTER_VALIDATE_BOOLEAN,FILTER_NULL_ON_FAILURE) returns null [ext/filter/tests/bug67167.02.phpt] XFAIL REASON: Requires php_zval_filter to not use convert_to_string for all filters. Phar: bug #69958: Segfault in Phar::convertToData on invalid file [ext/phar/tests/bug69958.phpt] XFAIL REASON: Still has memory leaks, see https://bugs.php.net/bug.php?id=70005 updateTimestamp never called when session data is empty [ext/session/tests/bug71162.phpt] XFAIL REASON: Current session module is designed to write empty session always. In addition, current session module only supports SessionHandlerInterface only from PHP 7.0. Bug #70219 Use after free vulnerability in session deserializer [ext/standard/tests/serialize/bug70219.phpt] XFAIL REASON: Unfinished merge, needs fix. Bug #70470 (Built-in server truncates headers spanning over TCP packets) [sapi/cli/tests/bug70470.phpt] XFAIL REASON: bug is not fixed yet FPM: Test status page [sapi/fpm/tests/010.phpt] XFAIL REASON: randomly intermittently failing all the time in CI, with diff: 017+ active processes: 0 018+ total processes: 1 017- active processes: 1 018- total processes: 2 FPM: Test various messages on start, from master and childs [sapi/fpm/tests/015.phpt] XFAIL REASON: randomly intermittently failing all the time in CI, ERROR: unable to read what child say: Bad file descriptor (9) catch_workers_output = yes seems not reliable ===================================================================== ===================================================================== FAILED TEST SUMMARY --------------------------------------------------------------------- Test for DateTime::modify() with absolute time statements [ext/date/tests/date-time-modify-times.phpt] Bug #73594 (dns_get_record() does not populate $additional out parameter - $authns parameter) [ext/standard/tests/network/bug73594a.phpt] bool dns_get_mx ( string $hostname , array &$mxhosts [, array &$weight ] ); [ext/standard/tests/network/dns_get_mx.phpt] gethostbyname() function - basic return valid ip address test [ext/standard/tests/network/gethostbyname_error004.phpt] getmxrr() test [ext/standard/tests/network/getmxrr.phpt] Bug #74090 stream_get_contents maxlength>-1 returns empty string on windows [ext/standard/tests/streams/bug74090.phpt] int stream_socket_sendto ( resource $socket , string $data [, int $flags = 0 [, string $address ]] ); [ext/standard/tests/streams/stream_socket_sendto.phpt] Bug #70436: Use After Free Vulnerability in unserialize() [ext/standard/tests/strings/bug70436.phpt] Bug #72663: Create an Unexpected Object and Don't Invoke __wakeup() in Deserialization [ext/standard/tests/strings/bug72663_3.phpt] FPM: Startup and connect [sapi/fpm/tests/002.phpt] FPM: Test Unix Domain Socket [sapi/fpm/tests/009.phpt] FPM: Test IPv4 all addresses (bug #68420) [sapi/fpm/tests/011.phpt] FPM: Test reload configuration (bug #68442) [sapi/fpm/tests/012.phpt] FPM: Test for log_level in fpm_unix_init_main #68381 [sapi/fpm/tests/013.phpt] FPM: Test for pm.start_servers default calculation message being a notice and not a warning #68458 [sapi/fpm/tests/014.phpt] FPM: Test fastcgi_finish_request function [sapi/fpm/tests/017.phpt] FPM: Test global prefix [sapi/fpm/tests/019.phpt] FPM: Test pool prefix [sapi/fpm/tests/020.phpt] FPM: HTTP_PROXY - CVE-2016-5385 [sapi/fpm/tests/022-cve-2016-5385.phpt] ===================================================================== ================================================================================ /apps/opt/mw/php-7.1.7/ext/date/tests/date-time-modify-times.phpt ================================================================================ Fri, 15 Oct 2010 23:00:00 +0000 Wed, 15 Dec 2010 16:15:00 +0000 Mon, 20 Dec 2010 00:00:00 +0000 Mon, 20 Dec 2010 10:00:00 +0000 Tue, 21 Dec 2010 12:00:00 +0000 Mon, 03 Jan 2011 00:00:00 +0000 Mon, 03 Jan 2011 09:00:00 +0000 Fri, 15 Oct 2010 23:00:00 +0100 Sun, 28 Mar 2010 00:15:00 +0000 Sun, 28 Mar 2010 02:15:00 +0100 Sun, 28 Mar 2010 02:15:00 +0100 ================================================================================ 001+ Fri, 15 Oct 2010 23:00:00 +0000 001- Sat, 23 Oct 2010 00:00:00 +0000 008+ Fri, 15 Oct 2010 23:00:00 +0100 008- Sat, 23 Oct 2010 00:00:00 +0100 ================================================================================ ================================================================================ /apps/opt/mw/php-7.1.7/ext/standard/tests/network/bug73594a.phpt ================================================================================ bool(true) ================================================================================ 001+ bool(true) 001- bool(false) ================================================================================ ================================================================================ /apps/opt/mw/php-7.1.7/ext/standard/tests/network/dns_get_mx.phpt ================================================================================ ================================================================================ 001+ 001- Hosts: %i, weights: %i 002- Hosts: %i, weights: %i 003- Hosts: %i, weights: %i 004- Hosts: %i, weights: %i 005- Hosts: %i, weights: %i ================================================================================ ================================================================================ /apps/opt/mw/php-7.1.7/ext/standard/tests/network/gethostbyname_error004.phpt ================================================================================ bool(false) ================================================================================ 001+ bool(false) 001- bool(true) ================================================================================ ================================================================================ /apps/opt/mw/php-7.1.7/ext/standard/tests/network/getmxrr.phpt ================================================================================ ================================================================================ 001+ 001- Hosts: 1, weights: 1 002- Hosts: 2, weights: 2 ================================================================================ ================================================================================ /apps/opt/mw/php-7.1.7/ext/standard/tests/streams/bug74090.phpt ================================================================================ bool(false) ==DONE== ================================================================================ 001+ bool(false) 001- bool(true) ================================================================================ ================================================================================ /apps/opt/mw/php-7.1.7/ext/standard/tests/streams/stream_socket_sendto.phpt ================================================================================ Notice: fwrite(): send of 23 bytes failed with errno=32 Broken pipe in /apps/opt/mw/php-7.1.7/ext/standard/tests/streams/stream_socket_sendto.php on line 9 Warning: stream_socket_sendto() expects at least 2 parameters, 0 given in /apps/opt/mw/php-7.1.7/ext/standard/tests/streams/stream_socket_sendto.php on line 10 bool(false) Warning: stream_socket_sendto() expects at least 2 parameters, 1 given in /apps/opt/mw/php-7.1.7/ext/standard/tests/streams/stream_socket_sendto.php on line 11 bool(false) Warning: stream_socket_sendto(): Broken pipe in /apps/opt/mw/php-7.1.7/ext/standard/tests/streams/stream_socket_sendto.php on line 12 int(-1) Warning: stream_socket_sendto(): Broken pipe in /apps/opt/mw/php-7.1.7/ext/standard/tests/streams/stream_socket_sendto.php on line 13 int(-1) Warning: stream_socket_sendto(): Broken pipe in /apps/opt/mw/php-7.1.7/ext/standard/tests/streams/stream_socket_sendto.php on line 14 int(-1) Warning: stream_socket_sendto(): php_network_getaddresses: getaddrinfo failed: Name or service not known in /apps/opt/mw/php-7.1.7/ext/standard/tests/streams/stream_socket_sendto.php on line 15 Warning: stream_socket_sendto(): Failed to resolve `http': php_network_getaddresses: getaddrinfo failed: Name or service not known in /apps/opt/mw/php-7.1.7/ext/standard/tests/streams/stream_socket_sendto.php on line 15 Warning: stream_socket_sendto(): Failed to parse `http://php.net' into a valid network address in /apps/opt/mw/php-7.1.7/ext/standard/tests/streams/stream_socket_sendto.php on line 15 bool(false) ================================================================================ 017+ Warning: stream_socket_sendto(): Broken pipe 018+ in /apps/opt/mw/php-7.1.7/ext/standard/tests/streams/stream_socket_sendto.php on line 14 019+ int(-1) 020+ 023- 024- Warning: stream_socket_sendto(): php_network_getaddresses: getaddrinfo failed: Name or service not known in %s on line %i 025- 026- Warning: stream_socket_sendto(): Failed to resolve %s: php_network_getaddresses: getaddrinfo failed: Name or service not known in %s on line %i 027- 028- Warning: stream_socket_sendto(): Failed to parse %s into a valid network address in %s on line %i 029- bool(%s) ================================================================================ ================================================================================ /apps/opt/mw/php-7.1.7/ext/standard/tests/strings/bug70436.phpt ================================================================================ Notice: unserialize(): Error at offset 0 of 3 bytes in /apps/opt/mw/php-7.1.7/ext/standard/tests/strings/bug70436.php on line 14 Notice: unserialize(): Error at offset 16 of 17 bytes in /apps/opt/mw/php-7.1.7/ext/standard/tests/strings/bug70436.php on line 14 Notice: unserialize(): Error at offset 93 of 94 bytes in /apps/opt/mw/php-7.1.7/ext/standard/tests/strings/bug70436.php on line 28 bool(false) DONE ================================================================================ 003+ Notice: unserialize(): Error at offset 16 of 17 bytes in /apps/opt/mw/php-7.1.7/ext/standard/tests/strings/bug70436.php on line 14 003- Notice: unserialize(): Error at offset 17 of 17 bytes in %sbug70436.php on line %d ================================================================================ ================================================================================ /apps/opt/mw/php-7.1.7/ext/standard/tests/strings/bug72663_3.phpt ================================================================================ Notice: unserialize(): Error at offset 50 of 50 bytes in /apps/opt/mw/php-7.1.7/ext/standard/tests/strings/bug72663_3.php on line 10 DONE ================================================================================ 001+ Notice: unserialize(): Error at offset 50 of 50 bytes in /apps/opt/mw/php-7.1.7/ext/standard/tests/strings/bug72663_3.php on line 10 001- Notice: unserialize(): Error at offset 51 of 50 bytes in %sbug72663_3.php on line %d ================================================================================ ================================================================================ /apps/opt/mw/php-7.1.7/sapi/fpm/tests/002.phpt ================================================================================ [26-Jul-2017 09:35:24] ALERT: [pool unconfined] user has not been defined [26-Jul-2017 09:35:24] ERROR: failed to post process the configuration ================================================================================ 001+ [26-Jul-2017 09:35:24] ALERT: [pool unconfined] user has not been defined 002+ [26-Jul-2017 09:35:24] ERROR: failed to post process the configuration 001- [%d-%s-%d %d:%d:%d] NOTICE: fpm is running, pid %d 002- [%d-%s-%d %d:%d:%d] NOTICE: ready to handle connections 003- Done ================================================================================ ================================================================================ /apps/opt/mw/php-7.1.7/sapi/fpm/tests/009.phpt ================================================================================ [26-Jul-2017 09:35:27] ALERT: [pool unconfined] user has not been defined [26-Jul-2017 09:35:27] ERROR: failed to post process the configuration Warning: fsockopen(): unable to connect to unix:///apps/opt/mw/php-7.1.7/sapi/fpm/tests/php-fpm.sock:-1 (No such file or directory) in /apps/opt/mw/php-7.1.7/sapi/fpm/tests/fcgi.inc on line 255 UDS error ================================================================================ 001+ [26-Jul-2017 09:35:27] ALERT: [pool unconfined] user has not been defined 002+ [26-Jul-2017 09:35:27] ERROR: failed to post process the configuration 003+ 004+ Warning: fsockopen(): unable to connect to unix:///apps/opt/mw/php-7.1.7/sapi/fpm/tests/php-fpm.sock:-1 (No such file or directory) in /apps/opt/mw/php-7.1.7/sapi/fpm/tests/fcgi.inc on line 255 001- [%d-%s-%d %d:%d:%d] NOTICE: fpm is running, pid %d 002- [%d-%s-%d %d:%d:%d] NOTICE: ready to handle connections 003- int(%d) 004- UDS ok 005+ UDS error ================================================================================ ================================================================================ /apps/opt/mw/php-7.1.7/sapi/fpm/tests/011.phpt ================================================================================ [26-Jul-2017 09:35:27] ALERT: [pool unconfined] user has not been defined [26-Jul-2017 09:35:27] ERROR: failed to post process the configuration Warning: fsockopen(): unable to connect to 127.0.0.1:9008 (Connection refused) in /apps/opt/mw/php-7.1.7/sapi/fpm/tests/fcgi.inc on line 255 IPv4 error ================================================================================ 001+ [26-Jul-2017 09:35:27] ALERT: [pool unconfined] user has not been defined 002+ [26-Jul-2017 09:35:27] ERROR: failed to post process the configuration 003+ 004+ Warning: fsockopen(): unable to connect to 127.0.0.1:9008 (Connection refused) in /apps/opt/mw/php-7.1.7/sapi/fpm/tests/fcgi.inc on line 255 001- [%d-%s-%d %d:%d:%d] NOTICE: fpm is running, pid %d 002- [%d-%s-%d %d:%d:%d] NOTICE: ready to handle connections 003- int(%d) 004- IPv4 ok 005+ IPv4 error ================================================================================ ================================================================================ /apps/opt/mw/php-7.1.7/sapi/fpm/tests/012.phpt ================================================================================ [26-Jul-2017 09:35:27] ALERT: [pool unconfined] user has not been defined [26-Jul-2017 09:35:27] ERROR: failed to post process the configuration Warning: fsockopen(): unable to connect to 127.0.0.1:9008 (Connection refused) in /apps/opt/mw/php-7.1.7/sapi/fpm/tests/fcgi.inc on line 255 IPv4 error Warning: file_get_contents(/apps/opt/mw/php-7.1.7/sapi/fpm/tests/php-fpm.pid): failed to open stream: No such file or directory in /apps/opt/mw/php-7.1.7/sapi/fpm/tests/012.php on line 34 PID not found ================================================================================ 001+ [26-Jul-2017 09:35:27] ALERT: [pool unconfined] user has not been defined 002+ [26-Jul-2017 09:35:27] ERROR: failed to post process the configuration 003+ 004+ Warning: fsockopen(): unable to connect to 127.0.0.1:9008 (Connection refused) in /apps/opt/mw/php-7.1.7/sapi/fpm/tests/fcgi.inc on line 255 005+ IPv4 error 006+ 007+ Warning: file_get_contents(/apps/opt/mw/php-7.1.7/sapi/fpm/tests/php-fpm.pid): failed to open stream: No such file or directory in /apps/opt/mw/php-7.1.7/sapi/fpm/tests/012.php on line 34 008+ PID not found 001- [%d-%s-%d %d:%d:%d] NOTICE: fpm is running, pid %d 002- [%d-%s-%d %d:%d:%d] NOTICE: ready to handle connections 003- int(%d) 004- IPv4 ok 005- [%d-%s-%d %d:%d:%d] NOTICE: Reloading in progress ... 006- [%d-%s-%d %d:%d:%d] NOTICE: reloading: %s 007- [%d-%s-%d %d:%d:%d] NOTICE: using inherited socket fd=%d, "127.0.0.1:%d" 008- [%d-%s-%d %d:%d:%d] NOTICE: fpm is running, pid %d 009- [%d-%s-%d %d:%d:%d] NOTICE: ready to handle connections 010- int(%d) 011- IPv4 ok ================================================================================ ================================================================================ /apps/opt/mw/php-7.1.7/sapi/fpm/tests/013.phpt ================================================================================ [26-Jul-2017 09:35:28] ERROR: [pool unconfined] cannot get uid for user 'foo' [26-Jul-2017 09:35:28] ERROR: FPM initialization failed Done ================================================================================ 001+ [26-Jul-2017 09:35:28] ERROR: [pool unconfined] cannot get uid for user 'foo' 002+ [26-Jul-2017 09:35:28] ERROR: FPM initialization failed 001- Started ================================================================================ ================================================================================ /apps/opt/mw/php-7.1.7/sapi/fpm/tests/014.phpt ================================================================================ [26-Jul-2017 09:35:31] ERROR: [pool unconfined] cannot get uid for user 'foo' [26-Jul-2017 09:35:31] ERROR: FPM initialization failed Done ================================================================================ 001+ [26-Jul-2017 09:35:31] ERROR: [pool unconfined] cannot get uid for user 'foo' 002+ [26-Jul-2017 09:35:31] ERROR: FPM initialization failed 001- Started ================================================================================ ================================================================================ /apps/opt/mw/php-7.1.7/sapi/fpm/tests/017.phpt ================================================================================ [26-Jul-2017 09:35:37] ALERT: [pool unconfined] user has not been defined [26-Jul-2017 09:35:37] ERROR: failed to post process the configuration Warning: fsockopen(): unable to connect to 127.0.0.1:9008 (Connection refused) in /apps/opt/mw/php-7.1.7/sapi/fpm/tests/fcgi.inc on line 255 Request error [26-Jul-2017 09:35:37] ERROR: FPM initialization failed Done ================================================================================ 001+ [26-Jul-2017 09:35:37] ALERT: [pool unconfined] user has not been defined 002+ [26-Jul-2017 09:35:37] ERROR: failed to post process the configuration 001- [%s] NOTICE: fpm is running, pid %d 002- [%s] NOTICE: ready to handle connections 003- Test Start 004+ Warning: fsockopen(): unable to connect to 127.0.0.1:9008 (Connection refused) in /apps/opt/mw/php-7.1.7/sapi/fpm/tests/fcgi.inc on line 255 005+ Request error 006+ [26-Jul-2017 09:35:37] ERROR: FPM initialization failed 005- Request ok 006- [%s] NOTICE: Terminating ... 007- [%s] NOTICE: exiting, bye-bye! ================================================================================ ================================================================================ /apps/opt/mw/php-7.1.7/sapi/fpm/tests/019.phpt ================================================================================ [26-Jul-2017 09:35:37] ALERT: [pool test] user has not been defined [26-Jul-2017 09:35:37] ERROR: failed to post process the configuration Warning: fsockopen(): unable to connect to 127.0.0.1:9008 (Connection refused) in /apps/opt/mw/php-7.1.7/sapi/fpm/tests/fcgi.inc on line 255 Ping error File php-fpm.log.tmp exists File php-fpm.acc.tmp missing File php-fpm.slw.tmp missing File php-fpm.pid.tmp missing [26-Jul-2017 09:35:37] ERROR: FPM initialization failed File php-fpm.pid.tmp removed Warning: readfile(/apps/opt/mw/php-7.1.7/sapi/fpm/tests/php-fpm.acc.tmp): failed to open stream: No such file or directory in /apps/opt/mw/php-7.1.7/sapi/fpm/tests/019.php on line 48 ================================================================================ 001+ [26-Jul-2017 09:35:37] ALERT: [pool test] user has not been defined 002+ [26-Jul-2017 09:35:37] ERROR: failed to post process the configuration 003+ 004+ Warning: fsockopen(): unable to connect to 127.0.0.1:9008 (Connection refused) in /apps/opt/mw/php-7.1.7/sapi/fpm/tests/fcgi.inc on line 255 005+ Ping error 001- [%s] NOTICE: fpm is running, pid %d 002- [%s] NOTICE: ready to handle connections 003- Ping ok 005- File php-fpm.acc.tmp exists 006- File php-fpm.slw.tmp exists 007- File php-fpm.pid.tmp exists 008- [%s] NOTICE: Terminating ... 009- [%s] NOTICE: exiting, bye-bye! 007+ File php-fpm.acc.tmp missing 008+ File php-fpm.slw.tmp missing 009+ File php-fpm.pid.tmp missing 010+ [26-Jul-2017 09:35:37] ERROR: FPM initialization failed 011- 127.0.0.1 - %s "GET /ping" 200 012+ 013+ Warning: readfile(/apps/opt/mw/php-7.1.7/sapi/fpm/tests/php-fpm.acc.tmp): failed to open stream: No such file or directory in /apps/opt/mw/php-7.1.7/sapi/fpm/tests/019.php on line 48 ================================================================================ ================================================================================ /apps/opt/mw/php-7.1.7/sapi/fpm/tests/020.phpt ================================================================================ [26-Jul-2017 09:35:37] ALERT: [pool test] user has not been defined [26-Jul-2017 09:35:37] ERROR: failed to post process the configuration Warning: fsockopen(): unable to connect to 127.0.0.1:9008 (Connection refused) in /apps/opt/mw/php-7.1.7/sapi/fpm/tests/fcgi.inc on line 255 Ping error File php-fpm.acc.tmp missing File php-fpm.slw.tmp missing [26-Jul-2017 09:35:37] ERROR: FPM initialization failed Warning: readfile(/apps/opt/mw/php-7.1.7/sapi/fpm/tests/php-fpm.acc.tmp): failed to open stream: No such file or directory in /apps/opt/mw/php-7.1.7/sapi/fpm/tests/020.php on line 47 ================================================================================ 001+ [26-Jul-2017 09:35:37] ALERT: [pool test] user has not been defined 002+ [26-Jul-2017 09:35:37] ERROR: failed to post process the configuration 003+ 004+ Warning: fsockopen(): unable to connect to 127.0.0.1:9008 (Connection refused) in /apps/opt/mw/php-7.1.7/sapi/fpm/tests/fcgi.inc on line 255 005+ Ping error 006+ File php-fpm.acc.tmp missing 007+ File php-fpm.slw.tmp missing 008+ [26-Jul-2017 09:35:37] ERROR: FPM initialization failed 001- [%s] NOTICE: fpm is running, pid %d 002- [%s] NOTICE: ready to handle connections 003- Ping ok 004- File php-fpm.acc.tmp exists 005- File php-fpm.slw.tmp exists 006- [%s] NOTICE: Terminating ... 007- [%s] NOTICE: exiting, bye-bye! 008- 127.0.0.1 - %s "GET /ping" 200 009+ 010+ Warning: readfile(/apps/opt/mw/php-7.1.7/sapi/fpm/tests/php-fpm.acc.tmp): failed to open stream: No such file or directory in /apps/opt/mw/php-7.1.7/sapi/fpm/tests/020.php on line 47 ================================================================================ ================================================================================ /apps/opt/mw/php-7.1.7/sapi/fpm/tests/022-cve-2016-5385.phpt ================================================================================ [26-Jul-2017 09:35:37] ALERT: [pool unconfined] user has not been defined [26-Jul-2017 09:35:37] ERROR: failed to post process the configuration Warning: fsockopen(): unable to connect to 127.0.0.1:9008 (Connection refused) in /apps/opt/mw/php-7.1.7/sapi/fpm/tests/fcgi.inc on line 255 Request error [26-Jul-2017 09:35:37] ERROR: FPM initialization failed Done ================================================================================ 001+ [26-Jul-2017 09:35:37] ALERT: [pool unconfined] user has not been defined 002+ [26-Jul-2017 09:35:37] ERROR: failed to post process the configuration 001- [%s] NOTICE: fpm is running, pid %d 002- [%s] NOTICE: ready to handle connections 003- Test Start 004- NULL 005- string(3) "BAR" 006- bool(false) 007- string(3) "BAR" 008- Test End 004+ Warning: fsockopen(): unable to connect to 127.0.0.1:9008 (Connection refused) in /apps/opt/mw/php-7.1.7/sapi/fpm/tests/fcgi.inc on line 255 005+ Request error 006+ [26-Jul-2017 09:35:37] ERROR: FPM initialization failed 010- Request ok 011- [%s] NOTICE: Terminating ... 012- [%s] NOTICE: exiting, bye-bye! ================================================================================ ================================================================================ BUILD ENVIRONMENT ================================================================================ OS: Linux - Linux w16tpaovp40 3.10.0-514.el7.x86_64 #1 SMP Thu Nov 3 17:15:05 PDT 2016 x86_64 Autoconf: Bundled Libtool: ltmain.sh (GNU libtool) 1.5.26 (1.1220.2.492 2008/01/30 06:40:56) Copyright (C) 2008 Free Software Foundation, Inc. This is free software; see the source for copying conditions. There is NO warranty; not even for MERCHANTABILITY or FITNESS FOR A PARTICULAR PURPOSE. System Libtool: N/A Compiler: Using built-in specs. COLLECT_GCC=cc COLLECT_LTO_WRAPPER=/usr/libexec/gcc/x86_64-redhat-linux/4.8.5/lto-wrapper Target: x86_64-redhat-linux Configured with: ../configure --prefix=/usr --mandir=/usr/share/man --infodir=/usr/share/info --with-bugurl=http://bugzilla.redhat.com/bugzilla --enable-bootstrap --enable-shared --enable-threads=posix --enable-checking=release --with-system-zlib --enable-__cxa_atexit --disable-libunwind-exceptions --enable-gnu-unique-object --enable-linker-build-id --with-linker-hash-style=gnu --enable-languages=c,c++,objc,obj-c++,java,fortran,ada,go,lto --enable-plugin --enable-initfini-array --disable-libgcj --with-isl=/builddir/build/BUILD/gcc-4.8.5-20150702/obj-x86_64-redhat-linux/isl-install --with-cloog=/builddir/build/BUILD/gcc-4.8.5-20150702/obj-x86_64-redhat-linux/cloog-install --enable-gnu-indirect-function --with-tune=generic --with-arch_32=x86-64 --build=x86_64-redhat-linux Thread model: posix gcc version 4.8.5 20150623 (Red Hat 4.8.5-11) (GCC) Bison: Libraries: linux-vdso.so.1 => (0x00007fff4d622000) libcrypt.so.1 => /lib64/libcrypt.so.1 (0x00007fdabda86000) libresolv.so.2 => /lib64/libresolv.so.2 (0x00007fdabd86c000) librt.so.1 => /lib64/librt.so.1 (0x00007fdabd663000) libm.so.6 => /lib64/libm.so.6 (0x00007fdabd361000) libdl.so.2 => /lib64/libdl.so.2 (0x00007fdabd15d000) libnsl.so.1 => /lib64/libnsl.so.1 (0x00007fdabcf43000) libxml2.so.2 => /lib64/libxml2.so.2 (0x00007fdabcbd9000) libz.so.1 => /lib64/libz.so.1 (0x00007fdabc9c3000) libc.so.6 => /lib64/libc.so.6 (0x00007fdabc600000) libfreebl3.so => /lib64/libfreebl3.so (0x00007fdabc3fd000) libpthread.so.0 => /lib64/libpthread.so.0 (0x00007fdabc1e1000) /lib64/ld-linux-x86-64.so.2 (0x00007fdabdcc7000) liblzma.so.5 => /lib64/liblzma.so.5 (0x00007fdabbfba000) User's E-mail: margaret dot m dot bauer at verizon dot com ================================================================================ PHPINFO ================================================================================ phpinfo() PHP Version => 7.1.7 System => Linux w16tpaovp40 3.10.0-514.el7.x86_64 #1 SMP Thu Nov 3 17:15:05 PDT 2016 x86_64 Build Date => Jul 26 2017 09:28:20 Configure Command => './configure' '--with-config-file-path=/apps/opt/mw/php' Server API => Command Line Interface Virtual Directory Support => disabled Configuration File (php.ini) Path => /apps/opt/mw/php Loaded Configuration File => (none) Scan this dir for additional .ini files => (none) Additional .ini files parsed => (none) PHP API => 20160303 PHP Extension => 20160303 Zend Extension => 320160303 Zend Extension Build => API320160303,NTS PHP Extension Build => API20160303,NTS Debug Build => no Thread Safety => disabled Zend Signal Handling => enabled Zend Memory Manager => enabled Zend Multibyte Support => disabled IPv6 Support => enabled DTrace Support => disabled Registered PHP Streams => php, file, glob, data, http, ftp, phar Registered Stream Socket Transports => tcp, udp, unix, udg Registered Stream Filters => convert.iconv.*, string.rot13, string.toupper, string.tolower, string.strip_tags, convert.*, consumed, dechunk This program makes use of the Zend Scripting Language Engine: Zend Engine v3.1.0, Copyright (c) 1998-2017 Zend Technologies _______________________________________________________________________ Configuration Core PHP Version => 7.1.7 Directive => Local Value => Master Value allow_url_fopen => On => On allow_url_include => Off => Off arg_separator.input => & => & arg_separator.output => & => & auto_append_file => no value => no value auto_globals_jit => On => On auto_prepend_file => no value => no value browscap => no value => no value default_charset => UTF-8 => UTF-8 default_mimetype => text/html => text/html disable_classes => no value => no value disable_functions => no value => no value display_errors => STDERR => STDERR display_startup_errors => Off => Off doc_root => no value => no value docref_ext => no value => no value docref_root => no value => no value enable_dl => On => On enable_post_data_reading => On => On error_append_string => no value => no value error_log => no value => no value error_prepend_string => no value => no value error_reporting => no value => no value expose_php => On => On extension_dir => /usr/local/lib/php/extensions/no-debug-non-zts-20160303 => /usr/local/lib/php/extensions/no-debug-non-zts-20160303 file_uploads => On => On hard_timeout => 2 => 2 highlight.comment => <font style="color: #FF8000">#FF8000</font> => <font style="color: #FF8000">#FF8000</font> highlight.default => <font style="color: #0000BB">#0000BB</font> => <font style="color: #0000BB">#0000BB</font> highlight.html => <font style="color: #000000">#000000</font> => <font style="color: #000000">#000000</font> highlight.keyword => <font style="color: #007700">#007700</font> => <font style="color: #007700">#007700</font> highlight.string => <font style="color: #DD0000">#DD0000</font> => <font style="color: #DD0000">#DD0000</font> html_errors => Off => Off ignore_repeated_errors => Off => Off ignore_repeated_source => Off => Off ignore_user_abort => Off => Off implicit_flush => On => On include_path => .:/usr/local/lib/php => .:/usr/local/lib/php input_encoding => no value => no value internal_encoding => no value => no value log_errors => Off => Off log_errors_max_len => 1024 => 1024 mail.add_x_header => Off => Off mail.force_extra_parameters => no value => no value mail.log => no value => no value max_execution_time => 0 => 0 max_file_uploads => 20 => 20 max_input_nesting_level => 64 => 64 max_input_time => -1 => -1 max_input_vars => 1000 => 1000 memory_limit => 128M => 128M open_basedir => no value => no value output_buffering => 0 => 0 output_encoding => no value => no value output_handler => no value => no value post_max_size => 8M => 8M precision => 14 => 14 realpath_cache_size => 4096K => 4096K realpath_cache_ttl => 120 => 120 register_argc_argv => On => On report_memleaks => On => On report_zend_debug => Off => Off request_order => no value => no value sendmail_from => no value => no value sendmail_path => /sbin/sendmail -t -i => /sbin/sendmail -t -i serialize_precision => -1 => -1 short_open_tag => On => On SMTP => localhost => localhost smtp_port => 25 => 25 sql.safe_mode => Off => Off sys_temp_dir => no value => no value track_errors => Off => Off unserialize_callback_func => no value => no value upload_max_filesize => 2M => 2M upload_tmp_dir => no value => no value user_dir => no value => no value user_ini.cache_ttl => 300 => 300 user_ini.filename => .user.ini => .user.ini variables_order => EGPCS => EGPCS xmlrpc_error_number => 0 => 0 xmlrpc_errors => Off => Off zend.assertions => 1 => 1 zend.detect_unicode => On => On zend.enable_gc => On => On zend.multibyte => Off => Off zend.script_encoding => no value => no value zend.signal_check => Off => Off ctype ctype functions => enabled date date/time support => enabled "Olson" Timezone Database Version => 2017.2 Timezone Database => internal Default timezone => UTC Directive => Local Value => Master Value date.default_latitude => 31.7667 => 31.7667 date.default_longitude => 35.2333 => 35.2333 date.sunrise_zenith => 90.583333 => 90.583333 date.sunset_zenith => 90.583333 => 90.583333 date.timezone => no value => no value dom DOM/XML => enabled DOM/XML API Version => 20031129 libxml Version => 2.9.1 HTML Support => enabled XPath Support => enabled XPointer Support => enabled Schema Support => enabled RelaxNG Support => enabled fileinfo fileinfo support => enabled version => 1.0.5 libmagic => 522 filter Input Validation and Filtering => enabled Revision => $Id: cdc5e15bb616f10210b94ecd8789e66c927a375f $ Directive => Local Value => Master Value filter.default => unsafe_raw => unsafe_raw filter.default_flags => no value => no value hash hash support => enabled Hashing Engines => md2 md4 md5 sha1 sha224 sha256 sha384 sha512/224 sha512/256 sha512 sha3-224 sha3-256 sha3-384 sha3-512 ripemd128 ripemd160 ripemd256 ripemd320 whirlpool tiger128,3 tiger160,3 tiger192,3 tiger128,4 tiger160,4 tiger192,4 snefru snefru256 gost gost-crypto adler32 crc32 crc32b fnv132 fnv1a32 fnv164 fnv1a64 joaat haval128,3 haval160,3 haval192,3 haval224,3 haval256,3 haval128,4 haval160,4 haval192,4 haval224,4 haval256,4 haval128,5 haval160,5 haval192,5 haval224,5 haval256,5 iconv iconv support => enabled iconv implementation => glibc iconv library version => 2.17 Directive => Local Value => Master Value iconv.input_encoding => no value => no value iconv.internal_encoding => no value => no value iconv.output_encoding => no value => no value json json support => enabled json version => 1.5.0 libxml libXML support => active libXML Compiled Version => 2.9.1 libXML Loaded Version => 20901 libXML streams => enabled pcre PCRE (Perl Compatible Regular Expressions) Support => enabled PCRE Library Version => 8.38 2015-11-23 PCRE JIT Support => enabled Directive => Local Value => Master Value pcre.backtrack_limit => 1000000 => 1000000 pcre.jit => 1 => 1 pcre.recursion_limit => 100000 => 100000 PDO PDO support => enabled PDO drivers => sqlite pdo_sqlite PDO Driver for SQLite 3.x => enabled SQLite Library => 3.15.1 Phar Phar: PHP Archive support => enabled Phar EXT version => 2.0.2 Phar API version => 1.1.1 SVN revision => $Id: 59c11f4e29768bfbbf6f41cb469abd81d8655850 $ Phar-based phar archives => enabled Tar-based phar archives => enabled ZIP-based phar archives => enabled gzip compression => disabled (install ext/zlib) bzip2 compression => disabled (install pecl/bz2) OpenSSL support => disabled (install ext/openssl) Phar based on pear/PHP_Archive, original concept by Davey Shafik. Phar fully realized by Gregory Beaver and Marcus Boerger. Portions of tar implementation Copyright (c) 2003-2009 Tim Kientzle. Directive => Local Value => Master Value phar.cache_list => no value => no value phar.readonly => On => On phar.require_hash => On => On posix Revision => $Id: b691ca925e7a085e6929579c4eba8fed0732e0ef $ Reflection Reflection => enabled Version => $Id: db7056e03b7071d15858224c1c6c472ec58ef401 $ session Session Support => enabled Registered save handlers => files user Registered serializer handlers => php_serialize php php_binary Directive => Local Value => Master Value session.auto_start => Off => Off session.cache_expire => 180 => 180 session.cache_limiter => nocache => nocache session.cookie_domain => no value => no value session.cookie_httponly => Off => Off session.cookie_lifetime => 0 => 0 session.cookie_path => / => / session.cookie_secure => Off => Off session.gc_divisor => 100 => 100 session.gc_maxlifetime => 1440 => 1440 session.gc_probability => 1 => 1 session.lazy_write => On => On session.name => PHPSESSID => PHPSESSID session.referer_check => no value => no value session.save_handler => files => files session.save_path => no value => no value session.serialize_handler => php => php session.sid_bits_per_character => 4 => 4 session.sid_length => 32 => 32 session.upload_progress.cleanup => On => On session.upload_progress.enabled => On => On session.upload_progress.freq => 1% => 1% session.upload_progress.min_freq => 1 => 1 session.upload_progress.name => PHP_SESSION_UPLOAD_PROGRESS => PHP_SESSION_UPLOAD_PROGRESS session.upload_progress.prefix => upload_progress_ => upload_progress_ session.use_cookies => On => On session.use_only_cookies => On => On session.use_strict_mode => Off => Off session.use_trans_sid => 0 => 0 SimpleXML Simplexml support => enabled Revision => $Id: 7e5516dcdf2fe6ded7970eaeb6abd8d07df39a2a $ Schema support => enabled SPL SPL support => enabled Interfaces => Countable, OuterIterator, RecursiveIterator, SeekableIterator, SplObserver, SplSubject Classes => AppendIterator, ArrayIterator, ArrayObject, BadFunctionCallException, BadMethodCallException, CachingIterator, CallbackFilterIterator, DirectoryIterator, DomainException, EmptyIterator, FilesystemIterator, FilterIterator, GlobIterator, InfiniteIterator, InvalidArgumentException, IteratorIterator, LengthException, LimitIterator, LogicException, MultipleIterator, NoRewindIterator, OutOfBoundsException, OutOfRangeException, OverflowException, ParentIterator, RangeException, RecursiveArrayIterator, RecursiveCachingIterator, RecursiveCallbackFilterIterator, RecursiveDirectoryIterator, RecursiveFilterIterator, RecursiveIteratorIterator, RecursiveRegexIterator, RecursiveTreeIterator, RegexIterator, RuntimeException, SplDoublyLinkedList, SplFileInfo, SplFileObject, SplFixedArray, SplHeap, SplMinHeap, SplMaxHeap, SplObjectStorage, SplPriorityQueue, SplQueue, SplStack, SplTempFileObject, UnderflowException, UnexpectedValueException sqlite3 SQLite3 support => enabled SQLite3 module version => 7.1.7 SQLite Library => 3.15.1 Directive => Local Value => Master Value sqlite3.extension_dir => no value => no value standard Dynamic Library Support => enabled Path to sendmail => /sbin/sendmail -t -i Directive => Local Value => Master Value assert.active => 1 => 1 assert.bail => 0 => 0 assert.callback => no value => no value assert.exception => 0 => 0 assert.quiet_eval => 0 => 0 assert.warning => 1 => 1 auto_detect_line_endings => 0 => 0 default_socket_timeout => 60 => 60 from => no value => no value session.trans_sid_hosts => no value => no value session.trans_sid_tags => a=href,area=href,frame=src,form= => a=href,area=href,frame=src,form= url_rewriter.hosts => no value => no value url_rewriter.tags => form= => form= user_agent => no value => no value tokenizer Tokenizer Support => enabled xml XML Support => active XML Namespace Support => active libxml2 Version => 2.9.1 xmlreader XMLReader => enabled xmlwriter XMLWriter => enabled Additional Modules Module Name Environment Variable => Value XDG_SESSION_ID => 51629 HOSTNAME => w16tpaovp40 TEST_PHP_SRCDIR => /apps/opt/mw/php-7.1.7 SHELL => /bin/bash TERM => xterm MAKEFLAGS => HISTSIZE => 1000 SSH_CLIENT => deleted TEST_PHPDBG_EXECUTABLE => /apps/opt/mw/php-7.1.7/sapi/phpdbg/phpdbg SSH_TTY => deleted USER => root LS_COLORS => rs=0:di=01;34:ln=01;36:mh=00:pi=40;33:so=01;35:do=01;35:bd=40;33;01:cd=40;33;01:or=40;31;01:mi=01;05;37;41:su=37;41:sg=30;43:ca=30;41:tw=30;42:ow=34;42:st=37;44:ex=01;32:*.tar=01;31:*.tgz=01;31:*.arc=01;31:*.arj=01;31:*.taz=01;31:*.lha=01;31:*.lz4=01;31:*.lzh=01;31:*.lzma=01;31:*.tlz=01;31:*.txz=01;31:*.tzo=01;31:*.t7z=01;31:*.zip=01;31:*.z=01;31:*.Z=01;31:*.dz=01;31:*.gz=01;31:*.lrz=01;31:*.lz=01;31:*.lzo=01;31:*.xz=01;31:*.bz2=01;31:*.bz=01;31:*.tbz=01;31:*.tbz2=01;31:*.tz=01;31:*.deb=01;31:*.rpm=01;31:*.jar=01;31:*.war=01;31:*.ear=01;31:*.sar=01;31:*.rar=01;31:*.alz=01;31:*.ace=01;31:*.zoo=01;31:*.cpio=01;31:*.7z=01;31:*.rz=01;31:*.cab=01;31:*.jpg=01;35:*.jpeg=01;35:*.gif=01;35:*.bmp=01;35:*.pbm=01;35:*.pgm=01;35:*.ppm=01;35:*.tga=01;35:*.xbm=01;35:*.xpm=01;35:*.tif=01;35:*.tiff=01;35:*.png=01;35:*.svg=01;35:*.svgz=01;35:*.mng=01;35:*.pcx=01;35:*.mov=01;35:*.mpg=01;35:*.mpeg=01;35:*.m2v=01;35:*.mkv=01;35:*.webm=01;35:*.ogm=01;35:*.mp4=01;35:*.m4v=01;35:*.mp4v=01;35:*.vob=01;35:*.qt=01;35:*.nuv=01;35:*.wmv=01;35:*.asf=01;35:*.rm=01;35:*.rmvb=01;35:*.flc=01;35:*.avi=01;35:*.fli=01;35:*.flv=01;35:*.gl=01;35:*.dl=01;35:*.xcf=01;35:*.xwd=01;35:*.yuv=01;35:*.cgm=01;35:*.emf=01;35:*.axv=01;35:*.anx=01;35:*.ogv=01;35:*.ogx=01;35:*.aac=01;36:*.au=01;36:*.flac=01;36:*.mid=01;36:*.midi=01;36:*.mka=01;36:*.mp3=01;36:*.mpc=01;36:*.ogg=01;36:*.ra=01;36:*.wav=01;36:*.axa=01;36:*.oga=01;36:*.spx=01;36:*.xspf=01;36: SSH_AUTH_SOCK => deleted MAKELEVEL => 1 MFLAGS => PATH => /usr/local/sbin:/usr/local/bin:/sbin:/bin:/usr/sbin:/usr/bin:/root/bin MAIL => /var/spool/mail/root _ => /apps/opt/mw/php-7.1.7/sapi/cli/php PWD => /apps/opt/mw/php-7.1.7 LANG => en_US.UTF-8 TEST_PHP_EXECUTABLE => /apps/opt/mw/php-7.1.7/sapi/cli/php HISTCONTROL => ignoredups HOME => /root SHLVL => 3 LOGNAME => root SSH_CONNECTION => deleted LESSOPEN => ||/usr/bin/lesspipe.sh %s CC => cc PHP Variables Variable => Value $_SERVER['XDG_SESSION_ID'] => 51629 $_SERVER['HOSTNAME'] => w16tpaovp40 $_SERVER['TEST_PHP_SRCDIR'] => /apps/opt/mw/php-7.1.7 $_SERVER['SHELL'] => /bin/bash $_SERVER['TERM'] => xterm $_SERVER['MAKEFLAGS'] => $_SERVER['HISTSIZE'] => 1000 $_SERVER['SSH_CLIENT'] => deleted $_SERVER['TEST_PHPDBG_EXECUTABLE'] => /apps/opt/mw/php-7.1.7/sapi/phpdbg/phpdbg $_SERVER['SSH_TTY'] => deleted $_SERVER['USER'] => root $_SERVER['LS_COLORS'] => rs=0:di=01;34:ln=01;36:mh=00:pi=40;33:so=01;35:do=01;35:bd=40;33;01:cd=40;33;01:or=40;31;01:mi=01;05;37;41:su=37;41:sg=30;43:ca=30;41:tw=30;42:ow=34;42:st=37;44:ex=01;32:*.tar=01;31:*.tgz=01;31:*.arc=01;31:*.arj=01;31:*.taz=01;31:*.lha=01;31:*.lz4=01;31:*.lzh=01;31:*.lzma=01;31:*.tlz=01;31:*.txz=01;31:*.tzo=01;31:*.t7z=01;31:*.zip=01;31:*.z=01;31:*.Z=01;31:*.dz=01;31:*.gz=01;31:*.lrz=01;31:*.lz=01;31:*.lzo=01;31:*.xz=01;31:*.bz2=01;31:*.bz=01;31:*.tbz=01;31:*.tbz2=01;31:*.tz=01;31:*.deb=01;31:*.rpm=01;31:*.jar=01;31:*.war=01;31:*.ear=01;31:*.sar=01;31:*.rar=01;31:*.alz=01;31:*.ace=01;31:*.zoo=01;31:*.cpio=01;31:*.7z=01;31:*.rz=01;31:*.cab=01;31:*.jpg=01;35:*.jpeg=01;35:*.gif=01;35:*.bmp=01;35:*.pbm=01;35:*.pgm=01;35:*.ppm=01;35:*.tga=01;35:*.xbm=01;35:*.xpm=01;35:*.tif=01;35:*.tiff=01;35:*.png=01;35:*.svg=01;35:*.svgz=01;35:*.mng=01;35:*.pcx=01;35:*.mov=01;35:*.mpg=01;35:*.mpeg=01;35:*.m2v=01;35:*.mkv=01;35:*.webm=01;35:*.ogm=01;35:*.mp4=01;35:*.m4v=01;35:*.mp4v=01;35:*.vob=01;35:*.qt=01;35:*.nuv=01;35:*.wmv=01;35:*.asf=01;35:*.rm=01;35:*.rmvb=01;35:*.flc=01;35:*.avi=01;35:*.fli=01;35:*.flv=01;35:*.gl=01;35:*.dl=01;35:*.xcf=01;35:*.xwd=01;35:*.yuv=01;35:*.cgm=01;35:*.emf=01;35:*.axv=01;35:*.anx=01;35:*.ogv=01;35:*.ogx=01;35:*.aac=01;36:*.au=01;36:*.flac=01;36:*.mid=01;36:*.midi=01;36:*.mka=01;36:*.mp3=01;36:*.mpc=01;36:*.ogg=01;36:*.ra=01;36:*.wav=01;36:*.axa=01;36:*.oga=01;36:*.spx=01;36:*.xspf=01;36: $_SERVER['SSH_AUTH_SOCK'] => deleted $_SERVER['MAKELEVEL'] => 1 $_SERVER['MFLAGS'] => $_SERVER['PATH'] => /usr/local/sbin:/usr/local/bin:/sbin:/bin:/usr/sbin:/usr/bin:/root/bin $_SERVER['MAIL'] => /var/spool/mail/root $_SERVER['_'] => /apps/opt/mw/php-7.1.7/sapi/cli/php $_SERVER['PWD'] => /apps/opt/mw/php-7.1.7 $_SERVER['LANG'] => en_US.UTF-8 $_SERVER['TEST_PHP_EXECUTABLE'] => /apps/opt/mw/php-7.1.7/sapi/cli/php $_SERVER['HISTCONTROL'] => ignoredups $_SERVER['HOME'] => /root $_SERVER['SHLVL'] => 3 $_SERVER['LOGNAME'] => root $_SERVER['SSH_CONNECTION'] => deleted $_SERVER['LESSOPEN'] => ||/usr/bin/lesspipe.sh %s $_SERVER['CC'] => cc $_SERVER['PHP_SELF'] => $_SERVER['SCRIPT_NAME'] => $_SERVER['SCRIPT_FILENAME'] => $_SERVER['PATH_TRANSLATED'] => $_SERVER['DOCUMENT_ROOT'] => $_SERVER['REQUEST_TIME_FLOAT'] => 1501076272.059 $_SERVER['REQUEST_TIME'] => 1501076272 $_SERVER['argv'] => Array ( ) $_SERVER['argc'] => 0 $_ENV['XDG_SESSION_ID'] => 51629 $_ENV['HOSTNAME'] => w16tpaovp40 $_ENV['TEST_PHP_SRCDIR'] => /apps/opt/mw/php-7.1.7 $_ENV['SHELL'] => /bin/bash $_ENV['TERM'] => xterm $_ENV['MAKEFLAGS'] => $_ENV['HISTSIZE'] => 1000 $_ENV['SSH_CLIENT'] => deleted $_ENV['TEST_PHPDBG_EXECUTABLE'] => /apps/opt/mw/php-7.1.7/sapi/phpdbg/phpdbg $_ENV['SSH_TTY'] => deleted $_ENV['USER'] => root $_ENV['LS_COLORS'] => rs=0:di=01;34:ln=01;36:mh=00:pi=40;33:so=01;35:do=01;35:bd=40;33;01:cd=40;33;01:or=40;31;01:mi=01;05;37;41:su=37;41:sg=30;43:ca=30;41:tw=30;42:ow=34;42:st=37;44:ex=01;32:*.tar=01;31:*.tgz=01;31:*.arc=01;31:*.arj=01;31:*.taz=01;31:*.lha=01;31:*.lz4=01;31:*.lzh=01;31:*.lzma=01;31:*.tlz=01;31:*.txz=01;31:*.tzo=01;31:*.t7z=01;31:*.zip=01;31:*.z=01;31:*.Z=01;31:*.dz=01;31:*.gz=01;31:*.lrz=01;31:*.lz=01;31:*.lzo=01;31:*.xz=01;31:*.bz2=01;31:*.bz=01;31:*.tbz=01;31:*.tbz2=01;31:*.tz=01;31:*.deb=01;31:*.rpm=01;31:*.jar=01;31:*.war=01;31:*.ear=01;31:*.sar=01;31:*.rar=01;31:*.alz=01;31:*.ace=01;31:*.zoo=01;31:*.cpio=01;31:*.7z=01;31:*.rz=01;31:*.cab=01;31:*.jpg=01;35:*.jpeg=01;35:*.gif=01;35:*.bmp=01;35:*.pbm=01;35:*.pgm=01;35:*.ppm=01;35:*.tga=01;35:*.xbm=01;35:*.xpm=01;35:*.tif=01;35:*.tiff=01;35:*.png=01;35:*.svg=01;35:*.svgz=01;35:*.mng=01;35:*.pcx=01;35:*.mov=01;35:*.mpg=01;35:*.mpeg=01;35:*.m2v=01;35:*.mkv=01;35:*.webm=01;35:*.ogm=01;35:*.mp4=01;35:*.m4v=01;35:*.mp4v=01;35:*.vob=01;35:*.qt=01;35:*.nuv=01;35:*.wmv=01;35:*.asf=01;35:*.rm=01;35:*.rmvb=01;35:*.flc=01;35:*.avi=01;35:*.fli=01;35:*.flv=01;35:*.gl=01;35:*.dl=01;35:*.xcf=01;35:*.xwd=01;35:*.yuv=01;35:*.cgm=01;35:*.emf=01;35:*.axv=01;35:*.anx=01;35:*.ogv=01;35:*.ogx=01;35:*.aac=01;36:*.au=01;36:*.flac=01;36:*.mid=01;36:*.midi=01;36:*.mka=01;36:*.mp3=01;36:*.mpc=01;36:*.ogg=01;36:*.ra=01;36:*.wav=01;36:*.axa=01;36:*.oga=01;36:*.spx=01;36:*.xspf=01;36: $_ENV['SSH_AUTH_SOCK'] => deleted $_ENV['MAKELEVEL'] => 1 $_ENV['MFLAGS'] => $_ENV['PATH'] => /usr/local/sbin:/usr/local/bin:/sbin:/bin:/usr/sbin:/usr/bin:/root/bin $_ENV['MAIL'] => /var/spool/mail/root $_ENV['_'] => /apps/opt/mw/php-7.1.7/sapi/cli/php $_ENV['PWD'] => /apps/opt/mw/php-7.1.7 $_ENV['LANG'] => en_US.UTF-8 $_ENV['TEST_PHP_EXECUTABLE'] => /apps/opt/mw/php-7.1.7/sapi/cli/php $_ENV['HISTCONTROL'] => ignoredups $_ENV['HOME'] => /root $_ENV['SHLVL'] => 3 $_ENV['LOGNAME'] => root $_ENV['SSH_CONNECTION'] => deleted $_ENV['LESSOPEN'] => ||/usr/bin/lesspipe.sh %s $_ENV['CC'] => cc PHP License This program is free software; you can redistribute it and/or modify it under the terms of the PHP License as published by the PHP Group and included in the distribution in the file: LICENSE This program is distributed in the hope that it will be useful, but WITHOUT ANY WARRANTY; without even the implied warranty of MERCHANTABILITY or FITNESS FOR A PARTICULAR PURPOSE. If you did not receive a copy of the PHP license, or have any questions about PHP licensing, please contact license@php.net.
« previous php.qa.reports (#33974) next »