5.6.31 // make test on debian 9.1 x86-64
| From: | Mircea Simion | Date: | Tue, 29 Aug 2017 19:50:20 +0000 |
| Subject: | 5.6.31 // make test on debian 9.1 x86-64 | ||
| Groups: | php.qa.reports | ||
| Request: | Send a blank email to php-qa-reports+get-33975@lists.php.net to get a copy of this message | ||
cheerios
--
*Mircea SIMION*
===================================================================== EXPECTED FAILED TEST SUMMARY --------------------------------------------------------------------- Test open_basedir configuration [tests/security/open_basedir_linkinfo.phpt] XFAIL REASON: BUG: open_basedir cannot delete symlink to prohibited file. See also bugs 48111 and 52176. Inconsistencies when accessing protected members [Zend/tests/access_modifiers_008.phpt] XFAIL REASON: Discussion: http://marc.info/?l=php-internals&m=120221184420957&w=2 Inconsistencies when accessing protected members - 2 [Zend/tests/access_modifiers_009.phpt] XFAIL REASON: Discussion: http://marc.info/?l=php-internals&m=120221184420957&w=2 Bug #48770 (call_user_func_array() fails to call parent from inheriting class) [Zend/tests/bug48770.phpt] XFAIL REASON: See Bug #48770 Bug #48770 (call_user_func_array() fails to call parent from inheriting class) [Zend/tests/bug48770_2.phpt] XFAIL REASON: See Bug #48770 Bug #48770 (call_user_func_array() fails to call parent from inheriting class) [Zend/tests/bug48770_3.phpt] XFAIL REASON: See Bug #48770 Bug #64896 (Segfault with gc_collect_cycles using unserialize on certain objects) [Zend/tests/bug64896.phpt] XFAIL REASON: We can not fix this bug without a significant (performace slow down) change to gc Initial value of static var in method depends on the include time of the class definition [Zend/tests/method_static_var.phpt] XFAIL REASON: Maybe not a bug DateTime::add() -- fall type2 type3 [ext/date/tests/DateTime_add-fall-type2-type3.phpt] XFAIL REASON: Various bugs exist DateTime::add() -- fall type3 type2 [ext/date/tests/DateTime_add-fall-type3-type2.phpt] XFAIL REASON: Various bugs exist DateTime::add() -- fall type3 type3 [ext/date/tests/DateTime_add-fall-type3-type3.phpt] XFAIL REASON: Various bugs exist DateTime::add() -- spring type2 type3 [ext/date/tests/DateTime_add-spring-type2-type3.phpt] XFAIL REASON: Various bugs exist DateTime::add() -- spring type3 type2 [ext/date/tests/DateTime_add-spring-type3-type2.phpt] XFAIL REASON: Various bugs exist DateTime::add() -- spring type3 type3 [ext/date/tests/DateTime_add-spring-type3-type3.phpt] XFAIL REASON: Various bugs exist DateTime::diff() -- fall type2 type3 [ext/date/tests/DateTime_diff-fall-type2-type3.phpt] XFAIL REASON: Various bugs exist DateTime::diff() -- fall type3 type2 [ext/date/tests/DateTime_diff-fall-type3-type2.phpt] XFAIL REASON: Various bugs exist DateTime::diff() -- fall type3 type3 [ext/date/tests/DateTime_diff-fall-type3-type3.phpt] XFAIL REASON: Various bugs exist DateTime::diff() -- spring type2 type3 [ext/date/tests/DateTime_diff-spring-type2-type3.phpt] XFAIL REASON: Various bugs exist DateTime::diff() -- spring type3 type2 [ext/date/tests/DateTime_diff-spring-type3-type2.phpt] XFAIL REASON: Various bugs exist DateTime::diff() -- spring type3 type3 [ext/date/tests/DateTime_diff-spring-type3-type3.phpt] XFAIL REASON: Various bugs exist DateTime::sub() -- fall type2 type3 [ext/date/tests/DateTime_sub-fall-type2-type3.phpt] XFAIL REASON: Various bugs exist DateTime::sub() -- fall type3 type2 [ext/date/tests/DateTime_sub-fall-type3-type2.phpt] XFAIL REASON: Various bugs exist DateTime::sub() -- fall type3 type3 [ext/date/tests/DateTime_sub-fall-type3-type3.phpt] XFAIL REASON: Various bugs exist DateTime::sub() -- spring type2 type3 [ext/date/tests/DateTime_sub-spring-type2-type3.phpt] XFAIL REASON: Various bugs exist DateTime::sub() -- spring type3 type2 [ext/date/tests/DateTime_sub-spring-type3-type2.phpt] XFAIL REASON: Various bugs exist DateTime::sub() -- spring type3 type3 [ext/date/tests/DateTime_sub-spring-type3-type3.phpt] XFAIL REASON: Various bugs exist RFC: DateTime and Daylight Saving Time Transitions (zone type 3, bd2) [ext/date/tests/rfc-datetime_and_daylight_saving_time-type3-bd2.phpt] XFAIL REASON: Still not quite right RFC: DateTime and Daylight Saving Time Transitions (zone type 3, fs) [ext/date/tests/rfc-datetime_and_daylight_saving_time-type3-fs.phpt] XFAIL REASON: Still not quite right Bug #42718 (unsafe_raw filter not applied when configured as default filter) [ext/filter/tests/bug42718.phpt] XFAIL REASON: FILTER_UNSAFE_RAW not applied when configured as default filter, even with flags Bug #67296 (filter_input doesn't validate variables) [ext/filter/tests/bug49184.phpt] XFAIL REASON: See Bug #49184 Bug #67167: filter_var(null,FILTER_VALIDATE_BOOLEAN,FILTER_NULL_ON_FAILURE) returns null [ext/filter/tests/bug67167.02.phpt] XFAIL REASON: Requires php_zval_filter to not use convert_to_string for all filters. zend multibyte (2) [ext/mbstring/tests/zend_multibyte-02.phpt] XFAIL REASON: https://bugs.php.net/bug.php?id=66582 zend multibyte (6) [ext/mbstring/tests/zend_multibyte-06.phpt] XFAIL REASON: https://bugs.php.net/bug.php?id=66582 zend multibyte (7) [ext/mbstring/tests/zend_multibyte-07.phpt] XFAIL REASON: https://bugs.php.net/bug.php?id=66582 zend multibyte (9) [ext/mbstring/tests/zend_multibyte-09.phpt] XFAIL REASON: https://bugs.php.net/bug.php?id=66582 Bug #72663: Create an Unexpected Object and Don't Invoke __wakeup() in Deserialization [ext/standard/tests/strings/bug72663_3.phpt] XFAIL REASON: Memory leak, TBF later. Bug #70470 (Built-in server truncates headers spanning over TCP packets) [sapi/cli/tests/bug70470.phpt] XFAIL REASON: bug is not fixed yet ===================================================================== ===================================================================== FAILED TEST SUMMARY --------------------------------------------------------------------- Bug #65538: SSL context "cafile" disallows URL stream wrappers [ext/openssl/tests/bug65538_002.phpt] Phar::setSupportedSignatures() with hash, tar-based [ext/phar/tests/tar/phar_setsignaturealgo2.phpt] ===================================================================== ===================================================================== WARNED TEST SUMMARY --------------------------------------------------------------------- zend multibyte (8) [ext/mbstring/tests/zend_multibyte-08.phpt] (warn: XFAIL section but test passes) zend multibyte (10) [ext/mbstring/tests/zend_multibyte-10.phpt] (warn: XFAIL section but test passes) zend multibyte (11) [ext/mbstring/tests/zend_multibyte-11.phpt] (warn: XFAIL section but test passes) Phar: bug #69958: Segfault in Phar::convertToData on invalid file [ext/phar/tests/bug69958.phpt] (warn: XFAIL section but test passes) Bug #69111 Crash in SessionHandler::read() [ext/session/tests/bug69111.phpt] (warn: XFAIL section but test passes) Bug #70172 - Use After Free Vulnerability in unserialize() [ext/standard/tests/serialize/bug70172.phpt] (warn: XFAIL section but test passes) ===================================================================== ===================================================================== TEST RESULT SUMMARY --------------------------------------------------------------------- Exts skipped : 47 Exts tested : 32 --------------------------------------------------------------------- Number of tests : 13925 10402 Tests skipped : 3523 ( 25.3%) -------- Tests warned : 6 ( 0.0%) ( 0.1%) Tests failed : 2 ( 0.0%) ( 0.0%) Expected fail : 37 ( 0.3%) ( 0.4%) Tests passed : 10357 ( 74.4%) ( 99.6%) --------------------------------------------------------------------- Time taken : 409 seconds ===================================================================== ===================================================================== EXPECTED FAILED TEST SUMMARY --------------------------------------------------------------------- Test open_basedir configuration [tests/security/open_basedir_linkinfo.phpt] XFAIL REASON: BUG: open_basedir cannot delete symlink to prohibited file. See also bugs 48111 and 52176. Inconsistencies when accessing protected members [Zend/tests/access_modifiers_008.phpt] XFAIL REASON: Discussion: http://marc.info/?l=php-internals&m=120221184420957&w=2 Inconsistencies when accessing protected members - 2 [Zend/tests/access_modifiers_009.phpt] XFAIL REASON: Discussion: http://marc.info/?l=php-internals&m=120221184420957&w=2 Bug #48770 (call_user_func_array() fails to call parent from inheriting class) [Zend/tests/bug48770.phpt] XFAIL REASON: See Bug #48770 Bug #48770 (call_user_func_array() fails to call parent from inheriting class) [Zend/tests/bug48770_2.phpt] XFAIL REASON: See Bug #48770 Bug #48770 (call_user_func_array() fails to call parent from inheriting class) [Zend/tests/bug48770_3.phpt] XFAIL REASON: See Bug #48770 Bug #64896 (Segfault with gc_collect_cycles using unserialize on certain objects) [Zend/tests/bug64896.phpt] XFAIL REASON: We can not fix this bug without a significant (performace slow down) change to gc Initial value of static var in method depends on the include time of the class definition [Zend/tests/method_static_var.phpt] XFAIL REASON: Maybe not a bug DateTime::add() -- fall type2 type3 [ext/date/tests/DateTime_add-fall-type2-type3.phpt] XFAIL REASON: Various bugs exist DateTime::add() -- fall type3 type2 [ext/date/tests/DateTime_add-fall-type3-type2.phpt] XFAIL REASON: Various bugs exist DateTime::add() -- fall type3 type3 [ext/date/tests/DateTime_add-fall-type3-type3.phpt] XFAIL REASON: Various bugs exist DateTime::add() -- spring type2 type3 [ext/date/tests/DateTime_add-spring-type2-type3.phpt] XFAIL REASON: Various bugs exist DateTime::add() -- spring type3 type2 [ext/date/tests/DateTime_add-spring-type3-type2.phpt] XFAIL REASON: Various bugs exist DateTime::add() -- spring type3 type3 [ext/date/tests/DateTime_add-spring-type3-type3.phpt] XFAIL REASON: Various bugs exist DateTime::diff() -- fall type2 type3 [ext/date/tests/DateTime_diff-fall-type2-type3.phpt] XFAIL REASON: Various bugs exist DateTime::diff() -- fall type3 type2 [ext/date/tests/DateTime_diff-fall-type3-type2.phpt] XFAIL REASON: Various bugs exist DateTime::diff() -- fall type3 type3 [ext/date/tests/DateTime_diff-fall-type3-type3.phpt] XFAIL REASON: Various bugs exist DateTime::diff() -- spring type2 type3 [ext/date/tests/DateTime_diff-spring-type2-type3.phpt] XFAIL REASON: Various bugs exist DateTime::diff() -- spring type3 type2 [ext/date/tests/DateTime_diff-spring-type3-type2.phpt] XFAIL REASON: Various bugs exist DateTime::diff() -- spring type3 type3 [ext/date/tests/DateTime_diff-spring-type3-type3.phpt] XFAIL REASON: Various bugs exist DateTime::sub() -- fall type2 type3 [ext/date/tests/DateTime_sub-fall-type2-type3.phpt] XFAIL REASON: Various bugs exist DateTime::sub() -- fall type3 type2 [ext/date/tests/DateTime_sub-fall-type3-type2.phpt] XFAIL REASON: Various bugs exist DateTime::sub() -- fall type3 type3 [ext/date/tests/DateTime_sub-fall-type3-type3.phpt] XFAIL REASON: Various bugs exist DateTime::sub() -- spring type2 type3 [ext/date/tests/DateTime_sub-spring-type2-type3.phpt] XFAIL REASON: Various bugs exist DateTime::sub() -- spring type3 type2 [ext/date/tests/DateTime_sub-spring-type3-type2.phpt] XFAIL REASON: Various bugs exist DateTime::sub() -- spring type3 type3 [ext/date/tests/DateTime_sub-spring-type3-type3.phpt] XFAIL REASON: Various bugs exist RFC: DateTime and Daylight Saving Time Transitions (zone type 3, bd2) [ext/date/tests/rfc-datetime_and_daylight_saving_time-type3-bd2.phpt] XFAIL REASON: Still not quite right RFC: DateTime and Daylight Saving Time Transitions (zone type 3, fs) [ext/date/tests/rfc-datetime_and_daylight_saving_time-type3-fs.phpt] XFAIL REASON: Still not quite right Bug #42718 (unsafe_raw filter not applied when configured as default filter) [ext/filter/tests/bug42718.phpt] XFAIL REASON: FILTER_UNSAFE_RAW not applied when configured as default filter, even with flags Bug #67296 (filter_input doesn't validate variables) [ext/filter/tests/bug49184.phpt] XFAIL REASON: See Bug #49184 Bug #67167: filter_var(null,FILTER_VALIDATE_BOOLEAN,FILTER_NULL_ON_FAILURE) returns null [ext/filter/tests/bug67167.02.phpt] XFAIL REASON: Requires php_zval_filter to not use convert_to_string for all filters. zend multibyte (2) [ext/mbstring/tests/zend_multibyte-02.phpt] XFAIL REASON: https://bugs.php.net/bug.php?id=66582 zend multibyte (6) [ext/mbstring/tests/zend_multibyte-06.phpt] XFAIL REASON: https://bugs.php.net/bug.php?id=66582 zend multibyte (7) [ext/mbstring/tests/zend_multibyte-07.phpt] XFAIL REASON: https://bugs.php.net/bug.php?id=66582 zend multibyte (9) [ext/mbstring/tests/zend_multibyte-09.phpt] XFAIL REASON: https://bugs.php.net/bug.php?id=66582 Bug #72663: Create an Unexpected Object and Don't Invoke __wakeup() in Deserialization [ext/standard/tests/strings/bug72663_3.phpt] XFAIL REASON: Memory leak, TBF later. Bug #70470 (Built-in server truncates headers spanning over TCP packets) [sapi/cli/tests/bug70470.phpt] XFAIL REASON: bug is not fixed yet ===================================================================== ===================================================================== FAILED TEST SUMMARY --------------------------------------------------------------------- Bug #65538: SSL context "cafile" disallows URL stream wrappers [ext/openssl/tests/bug65538_002.phpt] Phar::setSupportedSignatures() with hash, tar-based [ext/phar/tests/tar/phar_setsignaturealgo2.phpt] ===================================================================== ===================================================================== WARNED TEST SUMMARY --------------------------------------------------------------------- zend multibyte (8) [ext/mbstring/tests/zend_multibyte-08.phpt] (warn: XFAIL section but test passes) zend multibyte (10) [ext/mbstring/tests/zend_multibyte-10.phpt] (warn: XFAIL section but test passes) zend multibyte (11) [ext/mbstring/tests/zend_multibyte-11.phpt] (warn: XFAIL section but test passes) Phar: bug #69958: Segfault in Phar::convertToData on invalid file [ext/phar/tests/bug69958.phpt] (warn: XFAIL section but test passes) Bug #69111 Crash in SessionHandler::read() [ext/session/tests/bug69111.phpt] (warn: XFAIL section but test passes) Bug #70172 - Use After Free Vulnerability in unserialize() [ext/standard/tests/serialize/bug70172.phpt] (warn: XFAIL section but test passes) ===================================================================== ================================================================================ /www/stage/php-5.6.31/ext/openssl/tests/bug65538_002.phpt ================================================================================ Warning: file_get_contents(): SSL operation failed with code 1. OpenSSL Error messages: error:14090086:SSL routines:ssl3_get_server_certificate:certificate verify failed in /www/stage/php-5.6.31/ext/openssl/tests/bug65538_002.php on line 5 Warning: file_get_contents(): Failed to enable crypto in /www/stage/php-5.6.31/ext/openssl/tests/bug65538_002.php on line 5 Warning: failed loading cafile stream: `http://curl.haxx.se/ca/cacert.pem' in /www/stage/php-5.6.31/ext/openssl/tests/bug65538_002.php on line 5 Warning: file_get_contents(): Failed to enable crypto in /www/stage/php-5.6.31/ext/openssl/tests/bug65538_002.php on line 5 Warning: file_get_contents(https://github.com): failed to open stream: operation failed in /www/stage/php-5.6.31/ext/openssl/tests/bug65538_002.php on line 5 ================================================================================ 001+ Warning: file_get_contents(): SSL operation failed with code 1. OpenSSL Error messages: 002+ error:14090086:SSL routines:ssl3_get_server_certificate:certificate verify failed in /www/stage/php-5.6.31/ext/openssl/tests/bug65538_002.php on line 5 003+ 004+ Warning: file_get_contents(): Failed to enable crypto in /www/stage/php-5.6.31/ext/openssl/tests/bug65538_002.php on line 5 005+ 006+ Warning: failed loading cafile stream: `http://curl.haxx.se/ca/cacert.pem' in /www/stage/php-5.6.31/ext/openssl/tests/bug65538_002.php on line 5 001- Warning: remote cafile streams are disabled for security purposes in %s on line %d ================================================================================ ================================================================================ /www/stage/php-5.6.31/ext/phar/tests/tar/phar_setsignaturealgo2.phpt ================================================================================ array(2) { ["hash"]=> string(40) "05B343E6FF0F1F1D8ED787BE87355C06B31B490A" ["hash_type"]=> string(5) "SHA-1" } array(2) { ["hash"]=> string(32) "86F13838629B51CF26C7D7B0CB931114" ["hash_type"]=> string(3) "MD5" } array(2) { ["hash"]=> string(40) "05B343E6FF0F1F1D8ED787BE87355C06B31B490A" ["hash_type"]=> string(5) "SHA-1" } array(2) { ["hash"]=> string(64) "6558214D9E32D71D6E32BF1F2EBD4C70A049E85F9F82AE4D6A292F37A66D296C" ["hash_type"]=> string(7) "SHA-256" } array(2) { ["hash"]=> string(128) "3FA912F962957B67B04C01F3F9201313A23D7719BBF97B946DF06197E7A79833C80B77128E48E18C4E25D10C25CB78C2B9883FD64BA9930F7386EA44C1E7C9FE" ["hash_type"]=> string(7) "SHA-512" } phar error: unable to write signature to tar-based phar: unable to write phar "/www/stage/php-5.6.31/ext/phar/tests/tar/phar_setsignaturealgo2.phar.tar" with requested openssl signature===DONE=== ================================================================================ 031+ phar error: unable to write signature to tar-based phar: unable to write phar "/www/stage/php-5.6.31/ext/phar/tests/tar/phar_setsignaturealgo2.phar.tar" with requested openssl signature===DONE=== 031- array(2) { 032- ["hash"]=> 033- string(%d) "%s" 034- ["hash_type"]=> 035- string(7) "OpenSSL" 036- } 037- ===DONE=== ================================================================================ ================================================================================ BUILD ENVIRONMENT ================================================================================ OS: Linux - Linux ull 4.9.0-3-amd64 #1 SMP Debian 4.9.30-2+deb9u3 (2017-08-06) x86_64 Autoconf: autoconf (GNU Autoconf) 2.69 Copyright (C) 2012 Free Software Foundation, Inc. License GPLv3+/Autoconf: GNU GPL version 3 or later <http://gnu.org/licenses/gpl.html>, <http://gnu.org/licenses/exceptions.html> This is free software: you are free to change and redistribute it. There is NO WARRANTY, to the extent permitted by law. Written by David J. MacKenzie and Akim Demaille. Bundled Libtool: ltmain.sh (GNU libtool) 1.5.26 (1.1220.2.492 2008/01/30 06:40:56) Copyright (C) 2008 Free Software Foundation, Inc. This is free software; see the source for copying conditions. There is NO warranty; not even for MERCHANTABILITY or FITNESS FOR A PARTICULAR PURPOSE. System Libtool: libtool (GNU libtool) 2.4.6 Written by Gordon Matzigkeit, 1996 Copyright (C) 2014 Free Software Foundation, Inc. This is free software; see the source for copying conditions. There is NO warranty; not even for MERCHANTABILITY or FITNESS FOR A PARTICULAR PURPOSE. Compiler: Using built-in specs. COLLECT_GCC=cc COLLECT_LTO_WRAPPER=/usr/lib/gcc/x86_64-linux-gnu/6/lto-wrapper Target: x86_64-linux-gnu Configured with: ../src/configure -v --with-pkgversion='Debian 6.3.0-18' --with-bugurl=file:///usr/share/doc/gcc-6/README.Bugs --enable-languages=c,ada,c++,java,go,d,fortran,objc,obj-c++ --prefix=/usr --program-suffix=-6 --program-prefix=x86_64-linux-gnu- --enable-shared --enable-linker-build-id --libexecdir=/usr/lib --without-included-gettext --enable-threads=posix --libdir=/usr/lib --enable-nls --with-sysroot=/ --enable-clocale=gnu --enable-libstdcxx-debug --enable-libstdcxx-time=yes --with-default-libstdcxx-abi=new --enable-gnu-unique-object --disable-vtable-verify --enable-libmpx --enable-plugin --enable-default-pie --with-system-zlib --disable-browser-plugin --enable-java-awt=gtk --enable-gtk-cairo --with-java-home=/usr/lib/jvm/java-1.5.0-gcj-6-amd64/jre --enable-java-home --with-jvm-root-dir=/usr/lib/jvm/java-1.5.0-gcj-6-amd64 --with-jvm-jar-dir=/usr/lib/jvm-exports/java-1.5.0-gcj-6-amd64 --with-arch-directory=amd64 --with-ecj-jar=/usr/share/java/eclipse-ecj.jar --with-target-system-zlib --enable-objc-gc=auto --enable-multiarch --with-arch-32=i686 --with-abi=m64 --with-multilib-list=m32,m64,mx32 --enable-multilib --with-tune=generic --enable-checking=release --build=x86_64-linux-gnu --host=x86_64-linux-gnu --target=x86_64-linux-gnu Thread model: posix gcc version 6.3.0 20170516 (Debian 6.3.0-18) Bison: Libraries: linux-vdso.so.1 (0x00007ffd49bf3000) libfreetype.so.6 => /www/stack/lib/freetype/lib/libfreetype.so.6 (0x00007f1c5d283000) libz.so.1 => /lib/x86_64-linux-gnu/libz.so.1 (0x00007f1c5d04f000) libcrypt.so.1 => /lib/x86_64-linux-gnu/libcrypt.so.1 (0x00007f1c5ce17000) libresolv.so.2 => /lib/x86_64-linux-gnu/libresolv.so.2 (0x00007f1c5cc00000) librt.so.1 => /lib/x86_64-linux-gnu/librt.so.1 (0x00007f1c5c9f6000) libpng16.so.16 => /www/stack/lib/libpng/lib/libpng16.so.16 (0x00007f1c5c7b5000) libm.so.6 => /lib/x86_64-linux-gnu/libm.so.6 (0x00007f1c5c4b1000) libjpeg.so.9 => /www/stack/lib/jpeg/lib/libjpeg.so.9 (0x00007f1c5c25f000) libcrypto.so.1.0.0 => /www/stack/lib/openssl/lib/libcrypto.so.1.0.0 (0x00007f1c5be0b000) libssl.so.1.0.0 => /www/stack/lib/openssl/lib/libssl.so.1.0.0 (0x00007f1c5bb99000) libdl.so.2 => /lib/x86_64-linux-gnu/libdl.so.2 (0x00007f1c5b993000) libnsl.so.1 => /lib/x86_64-linux-gnu/libnsl.so.1 (0x00007f1c5b77b000) libxml2.so.2 => /usr/lib/x86_64-linux-gnu/libxml2.so.2 (0x00007f1c5b3c0000) libmysqlclient.so.18 => /www/stack/mysql/lib/libmysqlclient.so.18 (0x00007f1c5aed4000) libpthread.so.0 => /lib/x86_64-linux-gnu/libpthread.so.0 (0x00007f1c5acb7000) libc.so.6 => /lib/x86_64-linux-gnu/libc.so.6 (0x00007f1c5a918000) /lib64/ld-linux-x86-64.so.2 (0x000055bc256f6000) libicui18n.so.57 => /usr/lib/x86_64-linux-gnu/libicui18n.so.57 (0x00007f1c5a49c000) libicuuc.so.57 => /usr/lib/x86_64-linux-gnu/libicuuc.so.57 (0x00007f1c5a0f4000) libicudata.so.57 => /usr/lib/x86_64-linux-gnu/libicudata.so.57 (0x00007f1c58677000) liblzma.so.5 => /lib/x86_64-linux-gnu/liblzma.so.5 (0x00007f1c58451000) libstdc++.so.6 => /usr/lib/x86_64-linux-gnu/libstdc++.so.6 (0x00007f1c580cf000) libgcc_s.so.1 => /lib/x86_64-linux-gnu/libgcc_s.so.1 (0x00007f1c57eb8000) User's E-mail: mircea dot simion at gmail dot com ================================================================================ PHPINFO ================================================================================ phpinfo() PHP Version => 5.6.31 System => Linux ull 4.9.0-3-amd64 #1 SMP Debian 4.9.30-2+deb9u3 (2017-08-06) x86_64 Build Date => Aug 19 2017 17:01:52 Configure Command => './configure' '--prefix=/www/stack/php_new' '--with-apxs2=/www/stack/httpd/bin/apxs' '--enable-mbstring' '--with-mysqli=/www/stack/mysql/bin/mysql_config' '--with-gd=/www/stack/lib/libgd/lib' '--with-gd' '--with-jpeg-dir=/www/stack/lib/jpeg' '--with-freetype-dir=/www/stack/lib/freetype' '--with-png-dir=/www/stack/lib/libpng' '--with-openssl=/www/stack/lib/openssl' '--enable-soap' 'CFLAGS=-I/www/stack/lib/freetype/include/freetype2 '-L/www/stack/lib/freetype/lib' '-lfreetype'' Server API => Command Line Interface Virtual Directory Support => enabled Configuration File (php.ini) Path => /www/stack/php_new/lib Loaded Configuration File => (none) Scan this dir for additional .ini files => (none) Additional .ini files parsed => (none) PHP API => 20131106 PHP Extension => 20131226 Zend Extension => 220131226 Zend Extension Build => API220131226,TS PHP Extension Build => API20131226,TS Debug Build => no Thread Safety => enabled Zend Signal Handling => disabled Zend Memory Manager => enabled Zend Multibyte Support => provided by mbstring IPv6 Support => enabled DTrace Support => disabled Registered PHP Streams => https, ftps, php, file, glob, data, http, ftp, phar Registered Stream Socket Transports => tcp, udp, unix, udg, ssl, sslv3, tls, tlsv1.0, tlsv1.1, tlsv1.2 Registered Stream Filters => convert.iconv.*, string.rot13, string.toupper, string.tolower, string.strip_tags, convert.*, consumed, dechunk This program makes use of the Zend Scripting Language Engine: Zend Engine v2.6.0, Copyright (c) 1998-2016 Zend Technologies _______________________________________________________________________ Configuration Core PHP Version => 5.6.31 Directive => Local Value => Master Value allow_url_fopen => On => On allow_url_include => Off => Off always_populate_raw_post_data => 0 => 0 arg_separator.input => & => & arg_separator.output => & => & asp_tags => Off => Off auto_append_file => no value => no value auto_globals_jit => On => On auto_prepend_file => no value => no value browscap => no value => no value default_charset => UTF-8 => UTF-8 default_mimetype => text/html => text/html disable_classes => no value => no value disable_functions => no value => no value display_errors => STDERR => STDERR display_startup_errors => Off => Off doc_root => no value => no value docref_ext => no value => no value docref_root => no value => no value enable_dl => On => On enable_post_data_reading => On => On error_append_string => no value => no value error_log => no value => no value error_prepend_string => no value => no value error_reporting => no value => no value exit_on_timeout => Off => Off expose_php => On => On extension_dir => /www/stack/php_new/lib/php/extensions/no-debug-zts-20131226 => /www/stack/php_new/lib/php/extensions/no-debug-zts-20131226 file_uploads => On => On highlight.comment => <font style="color: #FF8000">#FF8000</font> => <font style="color: #FF8000">#FF8000</font> highlight.default => <font style="color: #0000BB">#0000BB</font> => <font style="color: #0000BB">#0000BB</font> highlight.html => <font style="color: #000000">#000000</font> => <font style="color: #000000">#000000</font> highlight.keyword => <font style="color: #007700">#007700</font> => <font style="color: #007700">#007700</font> highlight.string => <font style="color: #DD0000">#DD0000</font> => <font style="color: #DD0000">#DD0000</font> html_errors => Off => Off ignore_repeated_errors => Off => Off ignore_repeated_source => Off => Off ignore_user_abort => Off => Off implicit_flush => On => On include_path => .:/www/stack/php_new/lib/php => .:/www/stack/php_new/lib/php input_encoding => no value => no value internal_encoding => no value => no value log_errors => Off => Off log_errors_max_len => 1024 => 1024 mail.add_x_header => Off => Off mail.force_extra_parameters => no value => no value mail.log => no value => no value max_execution_time => 0 => 0 max_file_uploads => 20 => 20 max_input_nesting_level => 64 => 64 max_input_time => -1 => -1 max_input_vars => 1000 => 1000 memory_limit => 128M => 128M open_basedir => no value => no value output_buffering => 0 => 0 output_encoding => no value => no value output_handler => no value => no value post_max_size => 8M => 8M precision => 14 => 14 realpath_cache_size => 16K => 16K realpath_cache_ttl => 120 => 120 register_argc_argv => On => On report_memleaks => On => On report_zend_debug => Off => Off request_order => no value => no value sendmail_from => no value => no value sendmail_path => /usr/sbin/sendmail -t -i => /usr/sbin/sendmail -t -i serialize_precision => 17 => 17 short_open_tag => On => On SMTP => localhost => localhost smtp_port => 25 => 25 sql.safe_mode => Off => Off sys_temp_dir => no value => no value track_errors => Off => Off unserialize_callback_func => no value => no value upload_max_filesize => 2M => 2M upload_tmp_dir => no value => no value user_dir => no value => no value user_ini.cache_ttl => 300 => 300 user_ini.filename => .user.ini => .user.ini variables_order => EGPCS => EGPCS xmlrpc_error_number => 0 => 0 xmlrpc_errors => Off => Off zend.detect_unicode => On => On zend.enable_gc => On => On zend.multibyte => Off => Off zend.script_encoding => no value => no value ctype ctype functions => enabled date date/time support => enabled "Olson" Timezone Database Version => 2016.10 Timezone Database => internal Default timezone => UTC Directive => Local Value => Master Value date.default_latitude => 31.7667 => 31.7667 date.default_longitude => 35.2333 => 35.2333 date.sunrise_zenith => 90.583333 => 90.583333 date.sunset_zenith => 90.583333 => 90.583333 date.timezone => no value => no value dom DOM/XML => enabled DOM/XML API Version => 20031129 libxml Version => 2.9.4 HTML Support => enabled XPath Support => enabled XPointer Support => enabled Schema Support => enabled RelaxNG Support => enabled ereg Regex Library => Bundled library enabled fileinfo fileinfo support => enabled version => 1.0.5 libmagic => 517 filter Input Validation and Filtering => enabled Revision => $Id: 5b79667bd9a68977a9b4f7505223a8e216e04908 $ Directive => Local Value => Master Value filter.default => unsafe_raw => unsafe_raw filter.default_flags => no value => no value gd GD Support => enabled GD Version => bundled (2.1.0 compatible) FreeType Support => enabled FreeType Linkage => with freetype FreeType Version => 2.8.0 GIF Read Support => enabled GIF Create Support => enabled JPEG Support => enabled libJPEG Version => 9 compatible PNG Support => enabled libPNG Version => 1.6.30 WBMP Support => enabled XBM Support => enabled Directive => Local Value => Master Value gd.jpeg_ignore_warning => 0 => 0 hash hash support => enabled Hashing Engines => md2 md4 md5 sha1 sha224 sha256 sha384 sha512 ripemd128 ripemd160 ripemd256 ripemd320 whirlpool tiger128,3 tiger160,3 tiger192,3 tiger128,4 tiger160,4 tiger192,4 snefru snefru256 gost gost-crypto adler32 crc32 crc32b fnv132 fnv1a32 fnv164 fnv1a64 joaat haval128,3 haval160,3 haval192,3 haval224,3 haval256,3 haval128,4 haval160,4 haval192,4 haval224,4 haval256,4 haval128,5 haval160,5 haval192,5 haval224,5 haval256,5 iconv iconv support => enabled iconv implementation => glibc iconv library version => 2.24 Directive => Local Value => Master Value iconv.input_encoding => no value => no value iconv.internal_encoding => no value => no value iconv.output_encoding => no value => no value json json support => enabled json version => 1.2.1 libxml libXML support => active libXML Compiled Version => 2.9.4 libXML Loaded Version => 20904 libXML streams => enabled mbstring Multibyte Support => enabled Multibyte string engine => libmbfl HTTP input encoding translation => disabled libmbfl version => 1.3.2 mbstring extension makes use of "streamable kanji code filter and converter", which is distributed under the GNU Lesser General Public License version 2.1. Multibyte (japanese) regex support => enabled Multibyte regex (oniguruma) backtrack check => On Multibyte regex (oniguruma) version => 5.9.5 Directive => Local Value => Master Value mbstring.detect_order => no value => no value mbstring.encoding_translation => Off => Off mbstring.func_overload => 0 => 0 mbstring.http_input => no value => no value mbstring.http_output => no value => no value mbstring.http_output_conv_mimetypes => ^(text/|application/xhtml\+xml) => ^(text/|application/xhtml\+xml) mbstring.internal_encoding => no value => no value mbstring.language => neutral => neutral mbstring.strict_detection => Off => Off mbstring.substitute_character => no value => no value mysqli MysqlI Support => enabled Client API library version => 5.5.55 Active Persistent Links => 0 Inactive Persistent Links => 0 Active Links => 0 Client API header version => 5.5.55 MYSQLI_SOCKET => /tmp/mysql.sock Directive => Local Value => Master Value mysqli.allow_local_infile => On => On mysqli.allow_persistent => On => On mysqli.default_host => no value => no value mysqli.default_port => 3306 => 3306 mysqli.default_pw => no value => no value mysqli.default_socket => no value => no value mysqli.default_user => no value => no value mysqli.max_links => Unlimited => Unlimited mysqli.max_persistent => Unlimited => Unlimited mysqli.reconnect => Off => Off mysqli.rollback_on_cached_plink => Off => Off openssl OpenSSL support => enabled OpenSSL Library Version => OpenSSL 1.0.2l 25 May 2017 OpenSSL Header Version => OpenSSL 1.0.2l 25 May 2017 Openssl default config => /www/stack/lib/openssl/ssl/openssl.cnf Directive => Local Value => Master Value openssl.cafile => no value => no value openssl.capath => no value => no value pcre PCRE (Perl Compatible Regular Expressions) Support => enabled PCRE Library Version => 8.38 2015-11-23 Directive => Local Value => Master Value pcre.backtrack_limit => 1000000 => 1000000 pcre.recursion_limit => 100000 => 100000 PDO PDO support => enabled PDO drivers => sqlite pdo_sqlite PDO Driver for SQLite 3.x => enabled SQLite Library => 3.8.10.2 Phar Phar: PHP Archive support => enabled Phar EXT version => 2.0.2 Phar API version => 1.1.1 SVN revision => $Id: 780be432570e80dd34c1a9c217ef87ade22bf136 $ Phar-based phar archives => enabled Tar-based phar archives => enabled ZIP-based phar archives => enabled gzip compression => disabled (install ext/zlib) bzip2 compression => disabled (install pecl/bz2) OpenSSL support => enabled Phar based on pear/PHP_Archive, original concept by Davey Shafik. Phar fully realized by Gregory Beaver and Marcus Boerger. Portions of tar implementation Copyright (c) 2003-2009 Tim Kientzle. Directive => Local Value => Master Value phar.cache_list => no value => no value phar.readonly => On => On phar.require_hash => On => On posix Revision => $Id: 5f4acc20904b1406142f2a0ede068db048c77e77 $ Reflection Reflection => enabled Version => $Id: 5f15287237d5f78d75b19c26915aa7bd83dee8b8 $ session Session Support => enabled Registered save handlers => files user Registered serializer handlers => php_serialize php php_binary Directive => Local Value => Master Value session.auto_start => Off => Off session.cache_expire => 180 => 180 session.cache_limiter => nocache => nocache session.cookie_domain => no value => no value session.cookie_httponly => Off => Off session.cookie_lifetime => 0 => 0 session.cookie_path => / => / session.cookie_secure => Off => Off session.entropy_file => /dev/urandom => /dev/urandom session.entropy_length => 32 => 32 session.gc_divisor => 100 => 100 session.gc_maxlifetime => 1440 => 1440 session.gc_probability => 1 => 1 session.hash_bits_per_character => 4 => 4 session.hash_function => 0 => 0 session.name => PHPSESSID => PHPSESSID session.referer_check => no value => no value session.save_handler => files => files session.save_path => no value => no value session.serialize_handler => php => php session.upload_progress.cleanup => On => On session.upload_progress.enabled => On => On session.upload_progress.freq => 1% => 1% session.upload_progress.min_freq => 1 => 1 session.upload_progress.name => PHP_SESSION_UPLOAD_PROGRESS => PHP_SESSION_UPLOAD_PROGRESS session.upload_progress.prefix => upload_progress_ => upload_progress_ session.use_cookies => On => On session.use_only_cookies => On => On session.use_strict_mode => Off => Off session.use_trans_sid => 0 => 0 SimpleXML Simplexml support => enabled Revision => $Id: d7077fc935154236afb4fe70814ba358efdbdca4 $ Schema support => enabled soap Soap Client => enabled Soap Server => enabled Directive => Local Value => Master Value soap.wsdl_cache => 1 => 1 soap.wsdl_cache_dir => /tmp => /tmp soap.wsdl_cache_enabled => 1 => 1 soap.wsdl_cache_limit => 5 => 5 soap.wsdl_cache_ttl => 86400 => 86400 SPL SPL support => enabled Interfaces => Countable, OuterIterator, RecursiveIterator, SeekableIterator, SplObserver, SplSubject Classes => AppendIterator, ArrayIterator, ArrayObject, BadFunctionCallException, BadMethodCallException, CachingIterator, CallbackFilterIterator, DirectoryIterator, DomainException, EmptyIterator, FilesystemIterator, FilterIterator, GlobIterator, InfiniteIterator, InvalidArgumentException, IteratorIterator, LengthException, LimitIterator, LogicException, MultipleIterator, NoRewindIterator, OutOfBoundsException, OutOfRangeException, OverflowException, ParentIterator, RangeException, RecursiveArrayIterator, RecursiveCachingIterator, RecursiveCallbackFilterIterator, RecursiveDirectoryIterator, RecursiveFilterIterator, RecursiveIteratorIterator, RecursiveRegexIterator, RecursiveTreeIterator, RegexIterator, RuntimeException, SplDoublyLinkedList, SplFileInfo, SplFileObject, SplFixedArray, SplHeap, SplMinHeap, SplMaxHeap, SplObjectStorage, SplPriorityQueue, SplQueue, SplStack, SplTempFileObject, UnderflowException, UnexpectedValueException sqlite3 SQLite3 support => enabled SQLite3 module version => 0.7-dev SQLite Library => 3.8.10.2 Directive => Local Value => Master Value sqlite3.extension_dir => no value => no value standard Dynamic Library Support => enabled Path to sendmail => /usr/sbin/sendmail -t -i Directive => Local Value => Master Value assert.active => 1 => 1 assert.bail => 0 => 0 assert.callback => no value => no value assert.quiet_eval => 0 => 0 assert.warning => 1 => 1 auto_detect_line_endings => 0 => 0 default_socket_timeout => 60 => 60 from => no value => no value url_rewriter.tags => a=href,area=href,frame=src,form=,fieldset= => a=href,area=href,frame=src,form=,fieldset= user_agent => no value => no value tokenizer Tokenizer Support => enabled xml XML Support => active XML Namespace Support => active libxml2 Version => 2.9.4 xmlreader XMLReader => enabled xmlwriter XMLWriter => enabled Additional Modules Module Name Environment Variable => Value GJS_DEBUG_TOPICS => JS ERROR;JS LOG USER => jam SSH_CLIENT => deleted XDG_SEAT => seat0 SSH_AGENT_PID => 1071 XDG_SESSION_TYPE => x11 SHLVL => 2 TEST_PHP_SRCDIR => /www/stage/php-5.6.31 OLDPWD => /www/stage/php-5.6.31 HOME => /home/jam DESKTOP_SESSION => default SSH_TTY => deleted GTK_MODULES => gail:atk-bridge QT_LINUX_ACCESSIBILITY_ALWAYS_ON => 1 DBUS_SESSION_BUS_ADDRESS => unix:path=/run/user/1000/bus MAKEFLAGS => COLORTERM => truecolor MAKE_TERMERR => /dev/pts/1 QT_QPA_PLATFORMTHEME => qgnomeplatform LOGNAME => jam TEST_PHP_EXECUTABLE => /www/stage/php-5.6.31/sapi/cli/php JOURNAL_STREAM => 8:22965 WINDOWID => 31457286 _ => /www/stage/php-5.6.31/sapi/cli/php USERNAME => jam XDG_SESSION_ID => 2 TERM => xterm-256color GNOME_DESKTOP_SESSION_ID => this-is-deprecated WINDOWPATH => 2 PATH => /usr/local/bin:/usr/bin:/bin:/usr/local/games:/usr/games GDM_LANG => en_US.UTF-8 SESSION_MANAGER => local/ull:@/tmp/.ICE-unix/1023,unix/ull:/tmp/.ICE-unix/1023 XDG_MENU_PREFIX => gnome- MAKELEVEL => 1 XDG_RUNTIME_DIR => /run/user/1000 DISPLAY => :0 LANG => en_US.UTF-8 XDG_CURRENT_DESKTOP => GNOME LS_COLORS => rs=0:di=01;34:ln=01;36:mh=00:pi=40;33:so=01;35:do=01;35:bd=40;33;01:cd=40;33;01:or=40;31;01:mi=00:su=37;41:sg=30;43:ca=30;41:tw=30;42:ow=34;42:st=37;44:ex=01;32:*.tar=01;31:*.tgz=01;31:*.arc=01;31:*.arj=01;31:*.taz=01;31:*.lha=01;31:*.lz4=01;31:*.lzh=01;31:*.lzma=01;31:*.tlz=01;31:*.txz=01;31:*.tzo=01;31:*.t7z=01;31:*.zip=01;31:*.z=01;31:*.Z=01;31:*.dz=01;31:*.gz=01;31:*.lrz=01;31:*.lz=01;31:*.lzo=01;31:*.xz=01;31:*.zst=01;31:*.tzst=01;31:*.bz2=01;31:*.bz=01;31:*.tbz=01;31:*.tbz2=01;31:*.tz=01;31:*.deb=01;31:*.rpm=01;31:*.jar=01;31:*.war=01;31:*.ear=01;31:*.sar=01;31:*.rar=01;31:*.alz=01;31:*.ace=01;31:*.zoo=01;31:*.cpio=01;31:*.7z=01;31:*.rz=01;31:*.cab=01;31:*.jpg=01;35:*.jpeg=01;35:*.mjpg=01;35:*.mjpeg=01;35:*.gif=01;35:*.bmp=01;35:*.pbm=01;35:*.pgm=01;35:*.ppm=01;35:*.tga=01;35:*.xbm=01;35:*.xpm=01;35:*.tif=01;35:*.tiff=01;35:*.png=01;35:*.svg=01;35:*.svgz=01;35:*.mng=01;35:*.pcx=01;35:*.mov=01;35:*.mpg=01;35:*.mpeg=01;35:*.m2v=01;35:*.mkv=01;35:*.webm=01;35:*.ogm=01;35:*.mp4=01;35:*.m4v=01;35:*.mp4v=01;35:*.vob=01;35:*.qt=01;35:*.nuv=01;35:*.wmv=01;35:*.asf=01;35:*.rm=01;35:*.rmvb=01;35:*.flc=01;35:*.avi=01;35:*.fli=01;35:*.flv=01;35:*.gl=01;35:*.dl=01;35:*.xcf=01;35:*.xwd=01;35:*.yuv=01;35:*.cgm=01;35:*.emf=01;35:*.ogv=01;35:*.ogx=01;35:*.aac=00;36:*.au=00;36:*.flac=00;36:*.m4a=00;36:*.mid=00;36:*.midi=00;36:*.mka=00;36:*.mp3=00;36:*.mpc=00;36:*.ogg=00;36:*.ra=00;36:*.wav=00;36:*.oga=00;36:*.opus=00;36:*.spx=00;36:*.xspf=00;36: XDG_SESSION_DESKTOP => default XAUTHORITY => /run/user/1000/gdm/Xauthority SSH_AUTH_SOCK => deleted SHELL => /bin/bash MAKE_TERMOUT => /dev/pts/1 QT_ACCESSIBILITY => 1 GDMSESSION => default GJS_DEBUG_OUTPUT => stderr GPG_AGENT_INFO => /run/user/1000/gnupg/S.gpg-agent:0:1 XDG_VTNR => 2 PWD => /www/stage/php-5.6.31 XDG_DATA_DIRS => /usr/share/gnome:/usr/local/share/:/usr/share/ SSH_CONNECTION => deleted CC => /www/stage/php-5.6.31/meta_ccld MFLAGS => VTE_VERSION => 4601 PHP Variables Variable => Value _SERVER["GJS_DEBUG_TOPICS"] => JS ERROR;JS LOG _SERVER["USER"] => jam _SERVER["SSH_CLIENT"] => deleted _SERVER["XDG_SEAT"] => seat0 _SERVER["SSH_AGENT_PID"] => 1071 _SERVER["XDG_SESSION_TYPE"] => x11 _SERVER["SHLVL"] => 2 _SERVER["TEST_PHP_SRCDIR"] => /www/stage/php-5.6.31 _SERVER["OLDPWD"] => /www/stage/php-5.6.31 _SERVER["HOME"] => /home/jam _SERVER["DESKTOP_SESSION"] => default _SERVER["SSH_TTY"] => deleted _SERVER["GTK_MODULES"] => gail:atk-bridge _SERVER["QT_LINUX_ACCESSIBILITY_ALWAYS_ON"] => 1 _SERVER["DBUS_SESSION_BUS_ADDRESS"] => unix:path=/run/user/1000/bus _SERVER["MAKEFLAGS"] => _SERVER["COLORTERM"] => truecolor _SERVER["MAKE_TERMERR"] => /dev/pts/1 _SERVER["QT_QPA_PLATFORMTHEME"] => qgnomeplatform _SERVER["LOGNAME"] => jam _SERVER["TEST_PHP_EXECUTABLE"] => /www/stage/php-5.6.31/sapi/cli/php _SERVER["JOURNAL_STREAM"] => 8:22965 _SERVER["WINDOWID"] => 31457286 _SERVER["_"] => /www/stage/php-5.6.31/sapi/cli/php _SERVER["USERNAME"] => jam _SERVER["XDG_SESSION_ID"] => 2 _SERVER["TERM"] => xterm-256color _SERVER["GNOME_DESKTOP_SESSION_ID"] => this-is-deprecated _SERVER["WINDOWPATH"] => 2 _SERVER["PATH"] => /usr/local/bin:/usr/bin:/bin:/usr/local/games:/usr/games _SERVER["GDM_LANG"] => en_US.UTF-8 _SERVER["SESSION_MANAGER"] => local/ull:@/tmp/.ICE-unix/1023,unix/ull:/tmp/.ICE-unix/1023 _SERVER["XDG_MENU_PREFIX"] => gnome- _SERVER["MAKELEVEL"] => 1 _SERVER["XDG_RUNTIME_DIR"] => /run/user/1000 _SERVER["DISPLAY"] => :0 _SERVER["LANG"] => en_US.UTF-8 _SERVER["XDG_CURRENT_DESKTOP"] => GNOME _SERVER["LS_COLORS"] => rs=0:di=01;34:ln=01;36:mh=00:pi=40;33:so=01;35:do=01;35:bd=40;33;01:cd=40;33;01:or=40;31;01:mi=00:su=37;41:sg=30;43:ca=30;41:tw=30;42:ow=34;42:st=37;44:ex=01;32:*.tar=01;31:*.tgz=01;31:*.arc=01;31:*.arj=01;31:*.taz=01;31:*.lha=01;31:*.lz4=01;31:*.lzh=01;31:*.lzma=01;31:*.tlz=01;31:*.txz=01;31:*.tzo=01;31:*.t7z=01;31:*.zip=01;31:*.z=01;31:*.Z=01;31:*.dz=01;31:*.gz=01;31:*.lrz=01;31:*.lz=01;31:*.lzo=01;31:*.xz=01;31:*.zst=01;31:*.tzst=01;31:*.bz2=01;31:*.bz=01;31:*.tbz=01;31:*.tbz2=01;31:*.tz=01;31:*.deb=01;31:*.rpm=01;31:*.jar=01;31:*.war=01;31:*.ear=01;31:*.sar=01;31:*.rar=01;31:*.alz=01;31:*.ace=01;31:*.zoo=01;31:*.cpio=01;31:*.7z=01;31:*.rz=01;31:*.cab=01;31:*.jpg=01;35:*.jpeg=01;35:*.mjpg=01;35:*.mjpeg=01;35:*.gif=01;35:*.bmp=01;35:*.pbm=01;35:*.pgm=01;35:*.ppm=01;35:*.tga=01;35:*.xbm=01;35:*.xpm=01;35:*.tif=01;35:*.tiff=01;35:*.png=01;35:*.svg=01;35:*.svgz=01;35:*.mng=01;35:*.pcx=01;35:*.mov=01;35:*.mpg=01;35:*.mpeg=01;35:*.m2v=01;35:*.mkv=01;35:*.webm=01;35:*.ogm=01;35:*.mp4=01;35:*.m4v=01;35:*.mp4v=01;35:*.vob=01;35:*.qt=01;35:*.nuv=01;35:*.wmv=01;35:*.asf=01;35:*.rm=01;35:*.rmvb=01;35:*.flc=01;35:*.avi=01;35:*.fli=01;35:*.flv=01;35:*.gl=01;35:*.dl=01;35:*.xcf=01;35:*.xwd=01;35:*.yuv=01;35:*.cgm=01;35:*.emf=01;35:*.ogv=01;35:*.ogx=01;35:*.aac=00;36:*.au=00;36:*.flac=00;36:*.m4a=00;36:*.mid=00;36:*.midi=00;36:*.mka=00;36:*.mp3=00;36:*.mpc=00;36:*.ogg=00;36:*.ra=00;36:*.wav=00;36:*.oga=00;36:*.opus=00;36:*.spx=00;36:*.xspf=00;36: _SERVER["XDG_SESSION_DESKTOP"] => default _SERVER["XAUTHORITY"] => /run/user/1000/gdm/Xauthority _SERVER["SSH_AUTH_SOCK"] => deleted _SERVER["SHELL"] => /bin/bash _SERVER["MAKE_TERMOUT"] => /dev/pts/1 _SERVER["QT_ACCESSIBILITY"] => 1 _SERVER["GDMSESSION"] => default _SERVER["GJS_DEBUG_OUTPUT"] => stderr _SERVER["GPG_AGENT_INFO"] => /run/user/1000/gnupg/S.gpg-agent:0:1 _SERVER["XDG_VTNR"] => 2 _SERVER["PWD"] => /www/stage/php-5.6.31 _SERVER["XDG_DATA_DIRS"] => /usr/share/gnome:/usr/local/share/:/usr/share/ _SERVER["SSH_CONNECTION"] => deleted _SERVER["CC"] => /www/stage/php-5.6.31/meta_ccld _SERVER["MFLAGS"] => _SERVER["VTE_VERSION"] => 4601 _SERVER["PHP_SELF"] => _SERVER["SCRIPT_NAME"] => _SERVER["SCRIPT_FILENAME"] => _SERVER["PATH_TRANSLATED"] => _SERVER["DOCUMENT_ROOT"] => _SERVER["REQUEST_TIME_FLOAT"] => 1504036021.9869 _SERVER["REQUEST_TIME"] => 1504036021 _SERVER["argv"] => Array ( ) _SERVER["argc"] => 0 _ENV["GJS_DEBUG_TOPICS"] => JS ERROR;JS LOG _ENV["USER"] => jam _ENV["SSH_CLIENT"] => deleted _ENV["XDG_SEAT"] => seat0 _ENV["SSH_AGENT_PID"] => 1071 _ENV["XDG_SESSION_TYPE"] => x11 _ENV["SHLVL"] => 2 _ENV["TEST_PHP_SRCDIR"] => /www/stage/php-5.6.31 _ENV["OLDPWD"] => /www/stage/php-5.6.31 _ENV["HOME"] => /home/jam _ENV["DESKTOP_SESSION"] => default _ENV["SSH_TTY"] => deleted _ENV["GTK_MODULES"] => gail:atk-bridge _ENV["QT_LINUX_ACCESSIBILITY_ALWAYS_ON"] => 1 _ENV["DBUS_SESSION_BUS_ADDRESS"] => unix:path=/run/user/1000/bus _ENV["MAKEFLAGS"] => _ENV["COLORTERM"] => truecolor _ENV["MAKE_TERMERR"] => /dev/pts/1 _ENV["QT_QPA_PLATFORMTHEME"] => qgnomeplatform _ENV["LOGNAME"] => jam _ENV["TEST_PHP_EXECUTABLE"] => /www/stage/php-5.6.31/sapi/cli/php _ENV["JOURNAL_STREAM"] => 8:22965 _ENV["WINDOWID"] => 31457286 _ENV["_"] => /www/stage/php-5.6.31/sapi/cli/php _ENV["USERNAME"] => jam _ENV["XDG_SESSION_ID"] => 2 _ENV["TERM"] => xterm-256color _ENV["GNOME_DESKTOP_SESSION_ID"] => this-is-deprecated _ENV["WINDOWPATH"] => 2 _ENV["PATH"] => /usr/local/bin:/usr/bin:/bin:/usr/local/games:/usr/games _ENV["GDM_LANG"] => en_US.UTF-8 _ENV["SESSION_MANAGER"] => local/ull:@/tmp/.ICE-unix/1023,unix/ull:/tmp/.ICE-unix/1023 _ENV["XDG_MENU_PREFIX"] => gnome- _ENV["MAKELEVEL"] => 1 _ENV["XDG_RUNTIME_DIR"] => /run/user/1000 _ENV["DISPLAY"] => :0 _ENV["LANG"] => en_US.UTF-8 _ENV["XDG_CURRENT_DESKTOP"] => GNOME _ENV["LS_COLORS"] => rs=0:di=01;34:ln=01;36:mh=00:pi=40;33:so=01;35:do=01;35:bd=40;33;01:cd=40;33;01:or=40;31;01:mi=00:su=37;41:sg=30;43:ca=30;41:tw=30;42:ow=34;42:st=37;44:ex=01;32:*.tar=01;31:*.tgz=01;31:*.arc=01;31:*.arj=01;31:*.taz=01;31:*.lha=01;31:*.lz4=01;31:*.lzh=01;31:*.lzma=01;31:*.tlz=01;31:*.txz=01;31:*.tzo=01;31:*.t7z=01;31:*.zip=01;31:*.z=01;31:*.Z=01;31:*.dz=01;31:*.gz=01;31:*.lrz=01;31:*.lz=01;31:*.lzo=01;31:*.xz=01;31:*.zst=01;31:*.tzst=01;31:*.bz2=01;31:*.bz=01;31:*.tbz=01;31:*.tbz2=01;31:*.tz=01;31:*.deb=01;31:*.rpm=01;31:*.jar=01;31:*.war=01;31:*.ear=01;31:*.sar=01;31:*.rar=01;31:*.alz=01;31:*.ace=01;31:*.zoo=01;31:*.cpio=01;31:*.7z=01;31:*.rz=01;31:*.cab=01;31:*.jpg=01;35:*.jpeg=01;35:*.mjpg=01;35:*.mjpeg=01;35:*.gif=01;35:*.bmp=01;35:*.pbm=01;35:*.pgm=01;35:*.ppm=01;35:*.tga=01;35:*.xbm=01;35:*.xpm=01;35:*.tif=01;35:*.tiff=01;35:*.png=01;35:*.svg=01;35:*.svgz=01;35:*.mng=01;35:*.pcx=01;35:*.mov=01;35:*.mpg=01;35:*.mpeg=01;35:*.m2v=01;35:*.mkv=01;35:*.webm=01;35:*.ogm=01;35:*.mp4=01;35:*.m4v=01;35:*.mp4v=01;35:*.vob=01;35:*.qt=01;35:*.nuv=01;35:*.wmv=01;35:*.asf=01;35:*.rm=01;35:*.rmvb=01;35:*.flc=01;35:*.avi=01;35:*.fli=01;35:*.flv=01;35:*.gl=01;35:*.dl=01;35:*.xcf=01;35:*.xwd=01;35:*.yuv=01;35:*.cgm=01;35:*.emf=01;35:*.ogv=01;35:*.ogx=01;35:*.aac=00;36:*.au=00;36:*.flac=00;36:*.m4a=00;36:*.mid=00;36:*.midi=00;36:*.mka=00;36:*.mp3=00;36:*.mpc=00;36:*.ogg=00;36:*.ra=00;36:*.wav=00;36:*.oga=00;36:*.opus=00;36:*.spx=00;36:*.xspf=00;36: _ENV["XDG_SESSION_DESKTOP"] => default _ENV["XAUTHORITY"] => /run/user/1000/gdm/Xauthority _ENV["SSH_AUTH_SOCK"] => deleted _ENV["SHELL"] => /bin/bash _ENV["MAKE_TERMOUT"] => /dev/pts/1 _ENV["QT_ACCESSIBILITY"] => 1 _ENV["GDMSESSION"] => default _ENV["GJS_DEBUG_OUTPUT"] => stderr _ENV["GPG_AGENT_INFO"] => /run/user/1000/gnupg/S.gpg-agent:0:1 _ENV["XDG_VTNR"] => 2 _ENV["PWD"] => /www/stage/php-5.6.31 _ENV["XDG_DATA_DIRS"] => /usr/share/gnome:/usr/local/share/:/usr/share/ _ENV["SSH_CONNECTION"] => deleted _ENV["CC"] => /www/stage/php-5.6.31/meta_ccld _ENV["MFLAGS"] => _ENV["VTE_VERSION"] => 4601 PHP License This program is free software; you can redistribute it and/or modify it under the terms of the PHP License as published by the PHP Group and included in the distribution in the file: LICENSE This program is distributed in the hope that it will be useful, but WITHOUT ANY WARRANTY; without even the implied warranty of MERCHANTABILITY or FITNESS FOR A PARTICULAR PURPOSE. If you did not receive a copy of the PHP license, or have any questions about PHP licensing, please contact license@php.net.
===================================================================== EXPECTED FAILED TEST SUMMARY --------------------------------------------------------------------- Test open_basedir configuration [tests/security/open_basedir_linkinfo.phpt] XFAIL REASON: BUG: open_basedir cannot delete symlink to prohibited file. See also bugs 48111 and 52176. Inconsistencies when accessing protected members [Zend/tests/access_modifiers_008.phpt] XFAIL REASON: Discussion: http://marc.info/?l=php-internals&m=120221184420957&w=2 Inconsistencies when accessing protected members - 2 [Zend/tests/access_modifiers_009.phpt] XFAIL REASON: Discussion: http://marc.info/?l=php-internals&m=120221184420957&w=2 Bug #48770 (call_user_func_array() fails to call parent from inheriting class) [Zend/tests/bug48770.phpt] XFAIL REASON: See Bug #48770 Bug #48770 (call_user_func_array() fails to call parent from inheriting class) [Zend/tests/bug48770_2.phpt] XFAIL REASON: See Bug #48770 Bug #48770 (call_user_func_array() fails to call parent from inheriting class) [Zend/tests/bug48770_3.phpt] XFAIL REASON: See Bug #48770 Bug #64896 (Segfault with gc_collect_cycles using unserialize on certain objects) [Zend/tests/bug64896.phpt] XFAIL REASON: We can not fix this bug without a significant (performace slow down) change to gc Initial value of static var in method depends on the include time of the class definition [Zend/tests/method_static_var.phpt] XFAIL REASON: Maybe not a bug DateTime::add() -- fall type2 type3 [ext/date/tests/DateTime_add-fall-type2-type3.phpt] XFAIL REASON: Various bugs exist DateTime::add() -- fall type3 type2 [ext/date/tests/DateTime_add-fall-type3-type2.phpt] XFAIL REASON: Various bugs exist DateTime::add() -- fall type3 type3 [ext/date/tests/DateTime_add-fall-type3-type3.phpt] XFAIL REASON: Various bugs exist DateTime::add() -- spring type2 type3 [ext/date/tests/DateTime_add-spring-type2-type3.phpt] XFAIL REASON: Various bugs exist DateTime::add() -- spring type3 type2 [ext/date/tests/DateTime_add-spring-type3-type2.phpt] XFAIL REASON: Various bugs exist DateTime::add() -- spring type3 type3 [ext/date/tests/DateTime_add-spring-type3-type3.phpt] XFAIL REASON: Various bugs exist DateTime::diff() -- fall type2 type3 [ext/date/tests/DateTime_diff-fall-type2-type3.phpt] XFAIL REASON: Various bugs exist DateTime::diff() -- fall type3 type2 [ext/date/tests/DateTime_diff-fall-type3-type2.phpt] XFAIL REASON: Various bugs exist DateTime::diff() -- fall type3 type3 [ext/date/tests/DateTime_diff-fall-type3-type3.phpt] XFAIL REASON: Various bugs exist DateTime::diff() -- spring type2 type3 [ext/date/tests/DateTime_diff-spring-type2-type3.phpt] XFAIL REASON: Various bugs exist DateTime::diff() -- spring type3 type2 [ext/date/tests/DateTime_diff-spring-type3-type2.phpt] XFAIL REASON: Various bugs exist DateTime::diff() -- spring type3 type3 [ext/date/tests/DateTime_diff-spring-type3-type3.phpt] XFAIL REASON: Various bugs exist DateTime::sub() -- fall type2 type3 [ext/date/tests/DateTime_sub-fall-type2-type3.phpt] XFAIL REASON: Various bugs exist DateTime::sub() -- fall type3 type2 [ext/date/tests/DateTime_sub-fall-type3-type2.phpt] XFAIL REASON: Various bugs exist DateTime::sub() -- fall type3 type3 [ext/date/tests/DateTime_sub-fall-type3-type3.phpt] XFAIL REASON: Various bugs exist DateTime::sub() -- spring type2 type3 [ext/date/tests/DateTime_sub-spring-type2-type3.phpt] XFAIL REASON: Various bugs exist DateTime::sub() -- spring type3 type2 [ext/date/tests/DateTime_sub-spring-type3-type2.phpt] XFAIL REASON: Various bugs exist DateTime::sub() -- spring type3 type3 [ext/date/tests/DateTime_sub-spring-type3-type3.phpt] XFAIL REASON: Various bugs exist RFC: DateTime and Daylight Saving Time Transitions (zone type 3, bd2) [ext/date/tests/rfc-datetime_and_daylight_saving_time-type3-bd2.phpt] XFAIL REASON: Still not quite right RFC: DateTime and Daylight Saving Time Transitions (zone type 3, fs) [ext/date/tests/rfc-datetime_and_daylight_saving_time-type3-fs.phpt] XFAIL REASON: Still not quite right Bug #42718 (unsafe_raw filter not applied when configured as default filter) [ext/filter/tests/bug42718.phpt] XFAIL REASON: FILTER_UNSAFE_RAW not applied when configured as default filter, even with flags Bug #67296 (filter_input doesn't validate variables) [ext/filter/tests/bug49184.phpt] XFAIL REASON: See Bug #49184 Bug #67167: filter_var(null,FILTER_VALIDATE_BOOLEAN,FILTER_NULL_ON_FAILURE) returns null [ext/filter/tests/bug67167.02.phpt] XFAIL REASON: Requires php_zval_filter to not use convert_to_string for all filters. zend multibyte (2) [ext/mbstring/tests/zend_multibyte-02.phpt] XFAIL REASON: https://bugs.php.net/bug.php?id=66582 zend multibyte (6) [ext/mbstring/tests/zend_multibyte-06.phpt] XFAIL REASON: https://bugs.php.net/bug.php?id=66582 zend multibyte (7) [ext/mbstring/tests/zend_multibyte-07.phpt] XFAIL REASON: https://bugs.php.net/bug.php?id=66582 zend multibyte (9) [ext/mbstring/tests/zend_multibyte-09.phpt] XFAIL REASON: https://bugs.php.net/bug.php?id=66582 Bug #72663: Create an Unexpected Object and Don't Invoke __wakeup() in Deserialization [ext/standard/tests/strings/bug72663_3.phpt] XFAIL REASON: Memory leak, TBF later. Bug #70470 (Built-in server truncates headers spanning over TCP packets) [sapi/cli/tests/bug70470.phpt] XFAIL REASON: bug is not fixed yet ===================================================================== ===================================================================== FAILED TEST SUMMARY --------------------------------------------------------------------- Bug #65538: SSL context "cafile" disallows URL stream wrappers [ext/openssl/tests/bug65538_002.phpt] Phar::setSupportedSignatures() with hash, tar-based [ext/phar/tests/tar/phar_setsignaturealgo2.phpt] ===================================================================== ===================================================================== WARNED TEST SUMMARY --------------------------------------------------------------------- zend multibyte (8) [ext/mbstring/tests/zend_multibyte-08.phpt] (warn: XFAIL section but test passes) zend multibyte (10) [ext/mbstring/tests/zend_multibyte-10.phpt] (warn: XFAIL section but test passes) zend multibyte (11) [ext/mbstring/tests/zend_multibyte-11.phpt] (warn: XFAIL section but test passes) Phar: bug #69958: Segfault in Phar::convertToData on invalid file [ext/phar/tests/bug69958.phpt] (warn: XFAIL section but test passes) Bug #69111 Crash in SessionHandler::read() [ext/session/tests/bug69111.phpt] (warn: XFAIL section but test passes) Bug #70172 - Use After Free Vulnerability in unserialize() [ext/standard/tests/serialize/bug70172.phpt] (warn: XFAIL section but test passes) ===================================================================== ===================================================================== TEST RESULT SUMMARY --------------------------------------------------------------------- Exts skipped : 47 Exts tested : 32 --------------------------------------------------------------------- Number of tests : 13925 10402 Tests skipped : 3523 ( 25.3%) -------- Tests warned : 6 ( 0.0%) ( 0.1%) Tests failed : 2 ( 0.0%) ( 0.0%) Expected fail : 37 ( 0.3%) ( 0.4%) Tests passed : 10357 ( 74.4%) ( 99.6%) --------------------------------------------------------------------- Time taken : 409 seconds ===================================================================== ===================================================================== EXPECTED FAILED TEST SUMMARY --------------------------------------------------------------------- Test open_basedir configuration [tests/security/open_basedir_linkinfo.phpt] XFAIL REASON: BUG: open_basedir cannot delete symlink to prohibited file. See also bugs 48111 and 52176. Inconsistencies when accessing protected members [Zend/tests/access_modifiers_008.phpt] XFAIL REASON: Discussion: http://marc.info/?l=php-internals&m=120221184420957&w=2 Inconsistencies when accessing protected members - 2 [Zend/tests/access_modifiers_009.phpt] XFAIL REASON: Discussion: http://marc.info/?l=php-internals&m=120221184420957&w=2 Bug #48770 (call_user_func_array() fails to call parent from inheriting class) [Zend/tests/bug48770.phpt] XFAIL REASON: See Bug #48770 Bug #48770 (call_user_func_array() fails to call parent from inheriting class) [Zend/tests/bug48770_2.phpt] XFAIL REASON: See Bug #48770 Bug #48770 (call_user_func_array() fails to call parent from inheriting class) [Zend/tests/bug48770_3.phpt] XFAIL REASON: See Bug #48770 Bug #64896 (Segfault with gc_collect_cycles using unserialize on certain objects) [Zend/tests/bug64896.phpt] XFAIL REASON: We can not fix this bug without a significant (performace slow down) change to gc Initial value of static var in method depends on the include time of the class definition [Zend/tests/method_static_var.phpt] XFAIL REASON: Maybe not a bug DateTime::add() -- fall type2 type3 [ext/date/tests/DateTime_add-fall-type2-type3.phpt] XFAIL REASON: Various bugs exist DateTime::add() -- fall type3 type2 [ext/date/tests/DateTime_add-fall-type3-type2.phpt] XFAIL REASON: Various bugs exist DateTime::add() -- fall type3 type3 [ext/date/tests/DateTime_add-fall-type3-type3.phpt] XFAIL REASON: Various bugs exist DateTime::add() -- spring type2 type3 [ext/date/tests/DateTime_add-spring-type2-type3.phpt] XFAIL REASON: Various bugs exist DateTime::add() -- spring type3 type2 [ext/date/tests/DateTime_add-spring-type3-type2.phpt] XFAIL REASON: Various bugs exist DateTime::add() -- spring type3 type3 [ext/date/tests/DateTime_add-spring-type3-type3.phpt] XFAIL REASON: Various bugs exist DateTime::diff() -- fall type2 type3 [ext/date/tests/DateTime_diff-fall-type2-type3.phpt] XFAIL REASON: Various bugs exist DateTime::diff() -- fall type3 type2 [ext/date/tests/DateTime_diff-fall-type3-type2.phpt] XFAIL REASON: Various bugs exist DateTime::diff() -- fall type3 type3 [ext/date/tests/DateTime_diff-fall-type3-type3.phpt] XFAIL REASON: Various bugs exist DateTime::diff() -- spring type2 type3 [ext/date/tests/DateTime_diff-spring-type2-type3.phpt] XFAIL REASON: Various bugs exist DateTime::diff() -- spring type3 type2 [ext/date/tests/DateTime_diff-spring-type3-type2.phpt] XFAIL REASON: Various bugs exist DateTime::diff() -- spring type3 type3 [ext/date/tests/DateTime_diff-spring-type3-type3.phpt] XFAIL REASON: Various bugs exist DateTime::sub() -- fall type2 type3 [ext/date/tests/DateTime_sub-fall-type2-type3.phpt] XFAIL REASON: Various bugs exist DateTime::sub() -- fall type3 type2 [ext/date/tests/DateTime_sub-fall-type3-type2.phpt] XFAIL REASON: Various bugs exist DateTime::sub() -- fall type3 type3 [ext/date/tests/DateTime_sub-fall-type3-type3.phpt] XFAIL REASON: Various bugs exist DateTime::sub() -- spring type2 type3 [ext/date/tests/DateTime_sub-spring-type2-type3.phpt] XFAIL REASON: Various bugs exist DateTime::sub() -- spring type3 type2 [ext/date/tests/DateTime_sub-spring-type3-type2.phpt] XFAIL REASON: Various bugs exist DateTime::sub() -- spring type3 type3 [ext/date/tests/DateTime_sub-spring-type3-type3.phpt] XFAIL REASON: Various bugs exist RFC: DateTime and Daylight Saving Time Transitions (zone type 3, bd2) [ext/date/tests/rfc-datetime_and_daylight_saving_time-type3-bd2.phpt] XFAIL REASON: Still not quite right RFC: DateTime and Daylight Saving Time Transitions (zone type 3, fs) [ext/date/tests/rfc-datetime_and_daylight_saving_time-type3-fs.phpt] XFAIL REASON: Still not quite right Bug #42718 (unsafe_raw filter not applied when configured as default filter) [ext/filter/tests/bug42718.phpt] XFAIL REASON: FILTER_UNSAFE_RAW not applied when configured as default filter, even with flags Bug #67296 (filter_input doesn't validate variables) [ext/filter/tests/bug49184.phpt] XFAIL REASON: See Bug #49184 Bug #67167: filter_var(null,FILTER_VALIDATE_BOOLEAN,FILTER_NULL_ON_FAILURE) returns null [ext/filter/tests/bug67167.02.phpt] XFAIL REASON: Requires php_zval_filter to not use convert_to_string for all filters. zend multibyte (2) [ext/mbstring/tests/zend_multibyte-02.phpt] XFAIL REASON: https://bugs.php.net/bug.php?id=66582 zend multibyte (6) [ext/mbstring/tests/zend_multibyte-06.phpt] XFAIL REASON: https://bugs.php.net/bug.php?id=66582 zend multibyte (7) [ext/mbstring/tests/zend_multibyte-07.phpt] XFAIL REASON: https://bugs.php.net/bug.php?id=66582 zend multibyte (9) [ext/mbstring/tests/zend_multibyte-09.phpt] XFAIL REASON: https://bugs.php.net/bug.php?id=66582 Bug #72663: Create an Unexpected Object and Don't Invoke __wakeup() in Deserialization [ext/standard/tests/strings/bug72663_3.phpt] XFAIL REASON: Memory leak, TBF later. Bug #70470 (Built-in server truncates headers spanning over TCP packets) [sapi/cli/tests/bug70470.phpt] XFAIL REASON: bug is not fixed yet ===================================================================== ===================================================================== FAILED TEST SUMMARY --------------------------------------------------------------------- Bug #65538: SSL context "cafile" disallows URL stream wrappers [ext/openssl/tests/bug65538_002.phpt] Phar::setSupportedSignatures() with hash, tar-based [ext/phar/tests/tar/phar_setsignaturealgo2.phpt] ===================================================================== ===================================================================== WARNED TEST SUMMARY --------------------------------------------------------------------- zend multibyte (8) [ext/mbstring/tests/zend_multibyte-08.phpt] (warn: XFAIL section but test passes) zend multibyte (10) [ext/mbstring/tests/zend_multibyte-10.phpt] (warn: XFAIL section but test passes) zend multibyte (11) [ext/mbstring/tests/zend_multibyte-11.phpt] (warn: XFAIL section but test passes) Phar: bug #69958: Segfault in Phar::convertToData on invalid file [ext/phar/tests/bug69958.phpt] (warn: XFAIL section but test passes) Bug #69111 Crash in SessionHandler::read() [ext/session/tests/bug69111.phpt] (warn: XFAIL section but test passes) Bug #70172 - Use After Free Vulnerability in unserialize() [ext/standard/tests/serialize/bug70172.phpt] (warn: XFAIL section but test passes) ===================================================================== ================================================================================ /www/stage/php-5.6.31/ext/openssl/tests/bug65538_002.phpt ================================================================================ Warning: file_get_contents(): SSL operation failed with code 1. OpenSSL Error messages: error:14090086:SSL routines:ssl3_get_server_certificate:certificate verify failed in /www/stage/php-5.6.31/ext/openssl/tests/bug65538_002.php on line 5 Warning: file_get_contents(): Failed to enable crypto in /www/stage/php-5.6.31/ext/openssl/tests/bug65538_002.php on line 5 Warning: failed loading cafile stream: `http://curl.haxx.se/ca/cacert.pem' in /www/stage/php-5.6.31/ext/openssl/tests/bug65538_002.php on line 5 Warning: file_get_contents(): Failed to enable crypto in /www/stage/php-5.6.31/ext/openssl/tests/bug65538_002.php on line 5 Warning: file_get_contents(https://github.com): failed to open stream: operation failed in /www/stage/php-5.6.31/ext/openssl/tests/bug65538_002.php on line 5 ================================================================================ 001+ Warning: file_get_contents(): SSL operation failed with code 1. OpenSSL Error messages: 002+ error:14090086:SSL routines:ssl3_get_server_certificate:certificate verify failed in /www/stage/php-5.6.31/ext/openssl/tests/bug65538_002.php on line 5 003+ 004+ Warning: file_get_contents(): Failed to enable crypto in /www/stage/php-5.6.31/ext/openssl/tests/bug65538_002.php on line 5 005+ 006+ Warning: failed loading cafile stream: `http://curl.haxx.se/ca/cacert.pem' in /www/stage/php-5.6.31/ext/openssl/tests/bug65538_002.php on line 5 001- Warning: remote cafile streams are disabled for security purposes in %s on line %d ================================================================================ ================================================================================ /www/stage/php-5.6.31/ext/phar/tests/tar/phar_setsignaturealgo2.phpt ================================================================================ array(2) { ["hash"]=> string(40) "05B343E6FF0F1F1D8ED787BE87355C06B31B490A" ["hash_type"]=> string(5) "SHA-1" } array(2) { ["hash"]=> string(32) "86F13838629B51CF26C7D7B0CB931114" ["hash_type"]=> string(3) "MD5" } array(2) { ["hash"]=> string(40) "05B343E6FF0F1F1D8ED787BE87355C06B31B490A" ["hash_type"]=> string(5) "SHA-1" } array(2) { ["hash"]=> string(64) "6558214D9E32D71D6E32BF1F2EBD4C70A049E85F9F82AE4D6A292F37A66D296C" ["hash_type"]=> string(7) "SHA-256" } array(2) { ["hash"]=> string(128) "3FA912F962957B67B04C01F3F9201313A23D7719BBF97B946DF06197E7A79833C80B77128E48E18C4E25D10C25CB78C2B9883FD64BA9930F7386EA44C1E7C9FE" ["hash_type"]=> string(7) "SHA-512" } phar error: unable to write signature to tar-based phar: unable to write phar "/www/stage/php-5.6.31/ext/phar/tests/tar/phar_setsignaturealgo2.phar.tar" with requested openssl signature===DONE=== ================================================================================ 031+ phar error: unable to write signature to tar-based phar: unable to write phar "/www/stage/php-5.6.31/ext/phar/tests/tar/phar_setsignaturealgo2.phar.tar" with requested openssl signature===DONE=== 031- array(2) { 032- ["hash"]=> 033- string(%d) "%s" 034- ["hash_type"]=> 035- string(7) "OpenSSL" 036- } 037- ===DONE=== ================================================================================ ================================================================================ BUILD ENVIRONMENT ================================================================================ OS: Linux - Linux ull 4.9.0-3-amd64 #1 SMP Debian 4.9.30-2+deb9u3 (2017-08-06) x86_64 Autoconf: autoconf (GNU Autoconf) 2.69 Copyright (C) 2012 Free Software Foundation, Inc. License GPLv3+/Autoconf: GNU GPL version 3 or later <http://gnu.org/licenses/gpl.html>, <http://gnu.org/licenses/exceptions.html> This is free software: you are free to change and redistribute it. There is NO WARRANTY, to the extent permitted by law. Written by David J. MacKenzie and Akim Demaille. Bundled Libtool: ltmain.sh (GNU libtool) 1.5.26 (1.1220.2.492 2008/01/30 06:40:56) Copyright (C) 2008 Free Software Foundation, Inc. This is free software; see the source for copying conditions. There is NO warranty; not even for MERCHANTABILITY or FITNESS FOR A PARTICULAR PURPOSE. System Libtool: libtool (GNU libtool) 2.4.6 Written by Gordon Matzigkeit, 1996 Copyright (C) 2014 Free Software Foundation, Inc. This is free software; see the source for copying conditions. There is NO warranty; not even for MERCHANTABILITY or FITNESS FOR A PARTICULAR PURPOSE. Compiler: Using built-in specs. COLLECT_GCC=cc COLLECT_LTO_WRAPPER=/usr/lib/gcc/x86_64-linux-gnu/6/lto-wrapper Target: x86_64-linux-gnu Configured with: ../src/configure -v --with-pkgversion='Debian 6.3.0-18' --with-bugurl=file:///usr/share/doc/gcc-6/README.Bugs --enable-languages=c,ada,c++,java,go,d,fortran,objc,obj-c++ --prefix=/usr --program-suffix=-6 --program-prefix=x86_64-linux-gnu- --enable-shared --enable-linker-build-id --libexecdir=/usr/lib --without-included-gettext --enable-threads=posix --libdir=/usr/lib --enable-nls --with-sysroot=/ --enable-clocale=gnu --enable-libstdcxx-debug --enable-libstdcxx-time=yes --with-default-libstdcxx-abi=new --enable-gnu-unique-object --disable-vtable-verify --enable-libmpx --enable-plugin --enable-default-pie --with-system-zlib --disable-browser-plugin --enable-java-awt=gtk --enable-gtk-cairo --with-java-home=/usr/lib/jvm/java-1.5.0-gcj-6-amd64/jre --enable-java-home --with-jvm-root-dir=/usr/lib/jvm/java-1.5.0-gcj-6-amd64 --with-jvm-jar-dir=/usr/lib/jvm-exports/java-1.5.0-gcj-6-amd64 --with-arch-directory=amd64 --with-ecj-jar=/usr/share/java/eclipse-ecj.jar --with-target-system-zlib --enable-objc-gc=auto --enable-multiarch --with-arch-32=i686 --with-abi=m64 --with-multilib-list=m32,m64,mx32 --enable-multilib --with-tune=generic --enable-checking=release --build=x86_64-linux-gnu --host=x86_64-linux-gnu --target=x86_64-linux-gnu Thread model: posix gcc version 6.3.0 20170516 (Debian 6.3.0-18) Bison: Libraries: linux-vdso.so.1 (0x00007ffd49bf3000) libfreetype.so.6 => /www/stack/lib/freetype/lib/libfreetype.so.6 (0x00007f1c5d283000) libz.so.1 => /lib/x86_64-linux-gnu/libz.so.1 (0x00007f1c5d04f000) libcrypt.so.1 => /lib/x86_64-linux-gnu/libcrypt.so.1 (0x00007f1c5ce17000) libresolv.so.2 => /lib/x86_64-linux-gnu/libresolv.so.2 (0x00007f1c5cc00000) librt.so.1 => /lib/x86_64-linux-gnu/librt.so.1 (0x00007f1c5c9f6000) libpng16.so.16 => /www/stack/lib/libpng/lib/libpng16.so.16 (0x00007f1c5c7b5000) libm.so.6 => /lib/x86_64-linux-gnu/libm.so.6 (0x00007f1c5c4b1000) libjpeg.so.9 => /www/stack/lib/jpeg/lib/libjpeg.so.9 (0x00007f1c5c25f000) libcrypto.so.1.0.0 => /www/stack/lib/openssl/lib/libcrypto.so.1.0.0 (0x00007f1c5be0b000) libssl.so.1.0.0 => /www/stack/lib/openssl/lib/libssl.so.1.0.0 (0x00007f1c5bb99000) libdl.so.2 => /lib/x86_64-linux-gnu/libdl.so.2 (0x00007f1c5b993000) libnsl.so.1 => /lib/x86_64-linux-gnu/libnsl.so.1 (0x00007f1c5b77b000) libxml2.so.2 => /usr/lib/x86_64-linux-gnu/libxml2.so.2 (0x00007f1c5b3c0000) libmysqlclient.so.18 => /www/stack/mysql/lib/libmysqlclient.so.18 (0x00007f1c5aed4000) libpthread.so.0 => /lib/x86_64-linux-gnu/libpthread.so.0 (0x00007f1c5acb7000) libc.so.6 => /lib/x86_64-linux-gnu/libc.so.6 (0x00007f1c5a918000) /lib64/ld-linux-x86-64.so.2 (0x000055bc256f6000) libicui18n.so.57 => /usr/lib/x86_64-linux-gnu/libicui18n.so.57 (0x00007f1c5a49c000) libicuuc.so.57 => /usr/lib/x86_64-linux-gnu/libicuuc.so.57 (0x00007f1c5a0f4000) libicudata.so.57 => /usr/lib/x86_64-linux-gnu/libicudata.so.57 (0x00007f1c58677000) liblzma.so.5 => /lib/x86_64-linux-gnu/liblzma.so.5 (0x00007f1c58451000) libstdc++.so.6 => /usr/lib/x86_64-linux-gnu/libstdc++.so.6 (0x00007f1c580cf000) libgcc_s.so.1 => /lib/x86_64-linux-gnu/libgcc_s.so.1 (0x00007f1c57eb8000) User's E-mail: mircea dot simion at gmail dot com ================================================================================ PHPINFO ================================================================================ phpinfo() PHP Version => 5.6.31 System => Linux ull 4.9.0-3-amd64 #1 SMP Debian 4.9.30-2+deb9u3 (2017-08-06) x86_64 Build Date => Aug 19 2017 17:01:52 Configure Command => './configure' '--prefix=/www/stack/php_new' '--with-apxs2=/www/stack/httpd/bin/apxs' '--enable-mbstring' '--with-mysqli=/www/stack/mysql/bin/mysql_config' '--with-gd=/www/stack/lib/libgd/lib' '--with-gd' '--with-jpeg-dir=/www/stack/lib/jpeg' '--with-freetype-dir=/www/stack/lib/freetype' '--with-png-dir=/www/stack/lib/libpng' '--with-openssl=/www/stack/lib/openssl' '--enable-soap' 'CFLAGS=-I/www/stack/lib/freetype/include/freetype2 '-L/www/stack/lib/freetype/lib' '-lfreetype'' Server API => Command Line Interface Virtual Directory Support => enabled Configuration File (php.ini) Path => /www/stack/php_new/lib Loaded Configuration File => (none) Scan this dir for additional .ini files => (none) Additional .ini files parsed => (none) PHP API => 20131106 PHP Extension => 20131226 Zend Extension => 220131226 Zend Extension Build => API220131226,TS PHP Extension Build => API20131226,TS Debug Build => no Thread Safety => enabled Zend Signal Handling => disabled Zend Memory Manager => enabled Zend Multibyte Support => provided by mbstring IPv6 Support => enabled DTrace Support => disabled Registered PHP Streams => https, ftps, php, file, glob, data, http, ftp, phar Registered Stream Socket Transports => tcp, udp, unix, udg, ssl, sslv3, tls, tlsv1.0, tlsv1.1, tlsv1.2 Registered Stream Filters => convert.iconv.*, string.rot13, string.toupper, string.tolower, string.strip_tags, convert.*, consumed, dechunk This program makes use of the Zend Scripting Language Engine: Zend Engine v2.6.0, Copyright (c) 1998-2016 Zend Technologies _______________________________________________________________________ Configuration Core PHP Version => 5.6.31 Directive => Local Value => Master Value allow_url_fopen => On => On allow_url_include => Off => Off always_populate_raw_post_data => 0 => 0 arg_separator.input => & => & arg_separator.output => & => & asp_tags => Off => Off auto_append_file => no value => no value auto_globals_jit => On => On auto_prepend_file => no value => no value browscap => no value => no value default_charset => UTF-8 => UTF-8 default_mimetype => text/html => text/html disable_classes => no value => no value disable_functions => no value => no value display_errors => STDERR => STDERR display_startup_errors => Off => Off doc_root => no value => no value docref_ext => no value => no value docref_root => no value => no value enable_dl => On => On enable_post_data_reading => On => On error_append_string => no value => no value error_log => no value => no value error_prepend_string => no value => no value error_reporting => no value => no value exit_on_timeout => Off => Off expose_php => On => On extension_dir => /www/stack/php_new/lib/php/extensions/no-debug-zts-20131226 => /www/stack/php_new/lib/php/extensions/no-debug-zts-20131226 file_uploads => On => On highlight.comment => <font style="color: #FF8000">#FF8000</font> => <font style="color: #FF8000">#FF8000</font> highlight.default => <font style="color: #0000BB">#0000BB</font> => <font style="color: #0000BB">#0000BB</font> highlight.html => <font style="color: #000000">#000000</font> => <font style="color: #000000">#000000</font> highlight.keyword => <font style="color: #007700">#007700</font> => <font style="color: #007700">#007700</font> highlight.string => <font style="color: #DD0000">#DD0000</font> => <font style="color: #DD0000">#DD0000</font> html_errors => Off => Off ignore_repeated_errors => Off => Off ignore_repeated_source => Off => Off ignore_user_abort => Off => Off implicit_flush => On => On include_path => .:/www/stack/php_new/lib/php => .:/www/stack/php_new/lib/php input_encoding => no value => no value internal_encoding => no value => no value log_errors => Off => Off log_errors_max_len => 1024 => 1024 mail.add_x_header => Off => Off mail.force_extra_parameters => no value => no value mail.log => no value => no value max_execution_time => 0 => 0 max_file_uploads => 20 => 20 max_input_nesting_level => 64 => 64 max_input_time => -1 => -1 max_input_vars => 1000 => 1000 memory_limit => 128M => 128M open_basedir => no value => no value output_buffering => 0 => 0 output_encoding => no value => no value output_handler => no value => no value post_max_size => 8M => 8M precision => 14 => 14 realpath_cache_size => 16K => 16K realpath_cache_ttl => 120 => 120 register_argc_argv => On => On report_memleaks => On => On report_zend_debug => Off => Off request_order => no value => no value sendmail_from => no value => no value sendmail_path => /usr/sbin/sendmail -t -i => /usr/sbin/sendmail -t -i serialize_precision => 17 => 17 short_open_tag => On => On SMTP => localhost => localhost smtp_port => 25 => 25 sql.safe_mode => Off => Off sys_temp_dir => no value => no value track_errors => Off => Off unserialize_callback_func => no value => no value upload_max_filesize => 2M => 2M upload_tmp_dir => no value => no value user_dir => no value => no value user_ini.cache_ttl => 300 => 300 user_ini.filename => .user.ini => .user.ini variables_order => EGPCS => EGPCS xmlrpc_error_number => 0 => 0 xmlrpc_errors => Off => Off zend.detect_unicode => On => On zend.enable_gc => On => On zend.multibyte => Off => Off zend.script_encoding => no value => no value ctype ctype functions => enabled date date/time support => enabled "Olson" Timezone Database Version => 2016.10 Timezone Database => internal Default timezone => UTC Directive => Local Value => Master Value date.default_latitude => 31.7667 => 31.7667 date.default_longitude => 35.2333 => 35.2333 date.sunrise_zenith => 90.583333 => 90.583333 date.sunset_zenith => 90.583333 => 90.583333 date.timezone => no value => no value dom DOM/XML => enabled DOM/XML API Version => 20031129 libxml Version => 2.9.4 HTML Support => enabled XPath Support => enabled XPointer Support => enabled Schema Support => enabled RelaxNG Support => enabled ereg Regex Library => Bundled library enabled fileinfo fileinfo support => enabled version => 1.0.5 libmagic => 517 filter Input Validation and Filtering => enabled Revision => $Id: 5b79667bd9a68977a9b4f7505223a8e216e04908 $ Directive => Local Value => Master Value filter.default => unsafe_raw => unsafe_raw filter.default_flags => no value => no value gd GD Support => enabled GD Version => bundled (2.1.0 compatible) FreeType Support => enabled FreeType Linkage => with freetype FreeType Version => 2.8.0 GIF Read Support => enabled GIF Create Support => enabled JPEG Support => enabled libJPEG Version => 9 compatible PNG Support => enabled libPNG Version => 1.6.30 WBMP Support => enabled XBM Support => enabled Directive => Local Value => Master Value gd.jpeg_ignore_warning => 0 => 0 hash hash support => enabled Hashing Engines => md2 md4 md5 sha1 sha224 sha256 sha384 sha512 ripemd128 ripemd160 ripemd256 ripemd320 whirlpool tiger128,3 tiger160,3 tiger192,3 tiger128,4 tiger160,4 tiger192,4 snefru snefru256 gost gost-crypto adler32 crc32 crc32b fnv132 fnv1a32 fnv164 fnv1a64 joaat haval128,3 haval160,3 haval192,3 haval224,3 haval256,3 haval128,4 haval160,4 haval192,4 haval224,4 haval256,4 haval128,5 haval160,5 haval192,5 haval224,5 haval256,5 iconv iconv support => enabled iconv implementation => glibc iconv library version => 2.24 Directive => Local Value => Master Value iconv.input_encoding => no value => no value iconv.internal_encoding => no value => no value iconv.output_encoding => no value => no value json json support => enabled json version => 1.2.1 libxml libXML support => active libXML Compiled Version => 2.9.4 libXML Loaded Version => 20904 libXML streams => enabled mbstring Multibyte Support => enabled Multibyte string engine => libmbfl HTTP input encoding translation => disabled libmbfl version => 1.3.2 mbstring extension makes use of "streamable kanji code filter and converter", which is distributed under the GNU Lesser General Public License version 2.1. Multibyte (japanese) regex support => enabled Multibyte regex (oniguruma) backtrack check => On Multibyte regex (oniguruma) version => 5.9.5 Directive => Local Value => Master Value mbstring.detect_order => no value => no value mbstring.encoding_translation => Off => Off mbstring.func_overload => 0 => 0 mbstring.http_input => no value => no value mbstring.http_output => no value => no value mbstring.http_output_conv_mimetypes => ^(text/|application/xhtml\+xml) => ^(text/|application/xhtml\+xml) mbstring.internal_encoding => no value => no value mbstring.language => neutral => neutral mbstring.strict_detection => Off => Off mbstring.substitute_character => no value => no value mysqli MysqlI Support => enabled Client API library version => 5.5.55 Active Persistent Links => 0 Inactive Persistent Links => 0 Active Links => 0 Client API header version => 5.5.55 MYSQLI_SOCKET => /tmp/mysql.sock Directive => Local Value => Master Value mysqli.allow_local_infile => On => On mysqli.allow_persistent => On => On mysqli.default_host => no value => no value mysqli.default_port => 3306 => 3306 mysqli.default_pw => no value => no value mysqli.default_socket => no value => no value mysqli.default_user => no value => no value mysqli.max_links => Unlimited => Unlimited mysqli.max_persistent => Unlimited => Unlimited mysqli.reconnect => Off => Off mysqli.rollback_on_cached_plink => Off => Off openssl OpenSSL support => enabled OpenSSL Library Version => OpenSSL 1.0.2l 25 May 2017 OpenSSL Header Version => OpenSSL 1.0.2l 25 May 2017 Openssl default config => /www/stack/lib/openssl/ssl/openssl.cnf Directive => Local Value => Master Value openssl.cafile => no value => no value openssl.capath => no value => no value pcre PCRE (Perl Compatible Regular Expressions) Support => enabled PCRE Library Version => 8.38 2015-11-23 Directive => Local Value => Master Value pcre.backtrack_limit => 1000000 => 1000000 pcre.recursion_limit => 100000 => 100000 PDO PDO support => enabled PDO drivers => sqlite pdo_sqlite PDO Driver for SQLite 3.x => enabled SQLite Library => 3.8.10.2 Phar Phar: PHP Archive support => enabled Phar EXT version => 2.0.2 Phar API version => 1.1.1 SVN revision => $Id: 780be432570e80dd34c1a9c217ef87ade22bf136 $ Phar-based phar archives => enabled Tar-based phar archives => enabled ZIP-based phar archives => enabled gzip compression => disabled (install ext/zlib) bzip2 compression => disabled (install pecl/bz2) OpenSSL support => enabled Phar based on pear/PHP_Archive, original concept by Davey Shafik. Phar fully realized by Gregory Beaver and Marcus Boerger. Portions of tar implementation Copyright (c) 2003-2009 Tim Kientzle. Directive => Local Value => Master Value phar.cache_list => no value => no value phar.readonly => On => On phar.require_hash => On => On posix Revision => $Id: 5f4acc20904b1406142f2a0ede068db048c77e77 $ Reflection Reflection => enabled Version => $Id: 5f15287237d5f78d75b19c26915aa7bd83dee8b8 $ session Session Support => enabled Registered save handlers => files user Registered serializer handlers => php_serialize php php_binary Directive => Local Value => Master Value session.auto_start => Off => Off session.cache_expire => 180 => 180 session.cache_limiter => nocache => nocache session.cookie_domain => no value => no value session.cookie_httponly => Off => Off session.cookie_lifetime => 0 => 0 session.cookie_path => / => / session.cookie_secure => Off => Off session.entropy_file => /dev/urandom => /dev/urandom session.entropy_length => 32 => 32 session.gc_divisor => 100 => 100 session.gc_maxlifetime => 1440 => 1440 session.gc_probability => 1 => 1 session.hash_bits_per_character => 4 => 4 session.hash_function => 0 => 0 session.name => PHPSESSID => PHPSESSID session.referer_check => no value => no value session.save_handler => files => files session.save_path => no value => no value session.serialize_handler => php => php session.upload_progress.cleanup => On => On session.upload_progress.enabled => On => On session.upload_progress.freq => 1% => 1% session.upload_progress.min_freq => 1 => 1 session.upload_progress.name => PHP_SESSION_UPLOAD_PROGRESS => PHP_SESSION_UPLOAD_PROGRESS session.upload_progress.prefix => upload_progress_ => upload_progress_ session.use_cookies => On => On session.use_only_cookies => On => On session.use_strict_mode => Off => Off session.use_trans_sid => 0 => 0 SimpleXML Simplexml support => enabled Revision => $Id: d7077fc935154236afb4fe70814ba358efdbdca4 $ Schema support => enabled soap Soap Client => enabled Soap Server => enabled Directive => Local Value => Master Value soap.wsdl_cache => 1 => 1 soap.wsdl_cache_dir => /tmp => /tmp soap.wsdl_cache_enabled => 1 => 1 soap.wsdl_cache_limit => 5 => 5 soap.wsdl_cache_ttl => 86400 => 86400 SPL SPL support => enabled Interfaces => Countable, OuterIterator, RecursiveIterator, SeekableIterator, SplObserver, SplSubject Classes => AppendIterator, ArrayIterator, ArrayObject, BadFunctionCallException, BadMethodCallException, CachingIterator, CallbackFilterIterator, DirectoryIterator, DomainException, EmptyIterator, FilesystemIterator, FilterIterator, GlobIterator, InfiniteIterator, InvalidArgumentException, IteratorIterator, LengthException, LimitIterator, LogicException, MultipleIterator, NoRewindIterator, OutOfBoundsException, OutOfRangeException, OverflowException, ParentIterator, RangeException, RecursiveArrayIterator, RecursiveCachingIterator, RecursiveCallbackFilterIterator, RecursiveDirectoryIterator, RecursiveFilterIterator, RecursiveIteratorIterator, RecursiveRegexIterator, RecursiveTreeIterator, RegexIterator, RuntimeException, SplDoublyLinkedList, SplFileInfo, SplFileObject, SplFixedArray, SplHeap, SplMinHeap, SplMaxHeap, SplObjectStorage, SplPriorityQueue, SplQueue, SplStack, SplTempFileObject, UnderflowException, UnexpectedValueException sqlite3 SQLite3 support => enabled SQLite3 module version => 0.7-dev SQLite Library => 3.8.10.2 Directive => Local Value => Master Value sqlite3.extension_dir => no value => no value standard Dynamic Library Support => enabled Path to sendmail => /usr/sbin/sendmail -t -i Directive => Local Value => Master Value assert.active => 1 => 1 assert.bail => 0 => 0 assert.callback => no value => no value assert.quiet_eval => 0 => 0 assert.warning => 1 => 1 auto_detect_line_endings => 0 => 0 default_socket_timeout => 60 => 60 from => no value => no value url_rewriter.tags => a=href,area=href,frame=src,form=,fieldset= => a=href,area=href,frame=src,form=,fieldset= user_agent => no value => no value tokenizer Tokenizer Support => enabled xml XML Support => active XML Namespace Support => active libxml2 Version => 2.9.4 xmlreader XMLReader => enabled xmlwriter XMLWriter => enabled Additional Modules Module Name Environment Variable => Value GJS_DEBUG_TOPICS => JS ERROR;JS LOG USER => jam SSH_CLIENT => deleted XDG_SEAT => seat0 SSH_AGENT_PID => 1071 XDG_SESSION_TYPE => x11 SHLVL => 2 TEST_PHP_SRCDIR => /www/stage/php-5.6.31 OLDPWD => /www/stage/php-5.6.31 HOME => /home/jam DESKTOP_SESSION => default SSH_TTY => deleted GTK_MODULES => gail:atk-bridge QT_LINUX_ACCESSIBILITY_ALWAYS_ON => 1 DBUS_SESSION_BUS_ADDRESS => unix:path=/run/user/1000/bus MAKEFLAGS => COLORTERM => truecolor MAKE_TERMERR => /dev/pts/1 QT_QPA_PLATFORMTHEME => qgnomeplatform LOGNAME => jam TEST_PHP_EXECUTABLE => /www/stage/php-5.6.31/sapi/cli/php JOURNAL_STREAM => 8:22965 WINDOWID => 31457286 _ => /www/stage/php-5.6.31/sapi/cli/php USERNAME => jam XDG_SESSION_ID => 2 TERM => xterm-256color GNOME_DESKTOP_SESSION_ID => this-is-deprecated WINDOWPATH => 2 PATH => /usr/local/bin:/usr/bin:/bin:/usr/local/games:/usr/games GDM_LANG => en_US.UTF-8 SESSION_MANAGER => local/ull:@/tmp/.ICE-unix/1023,unix/ull:/tmp/.ICE-unix/1023 XDG_MENU_PREFIX => gnome- MAKELEVEL => 1 XDG_RUNTIME_DIR => /run/user/1000 DISPLAY => :0 LANG => en_US.UTF-8 XDG_CURRENT_DESKTOP => GNOME LS_COLORS => rs=0:di=01;34:ln=01;36:mh=00:pi=40;33:so=01;35:do=01;35:bd=40;33;01:cd=40;33;01:or=40;31;01:mi=00:su=37;41:sg=30;43:ca=30;41:tw=30;42:ow=34;42:st=37;44:ex=01;32:*.tar=01;31:*.tgz=01;31:*.arc=01;31:*.arj=01;31:*.taz=01;31:*.lha=01;31:*.lz4=01;31:*.lzh=01;31:*.lzma=01;31:*.tlz=01;31:*.txz=01;31:*.tzo=01;31:*.t7z=01;31:*.zip=01;31:*.z=01;31:*.Z=01;31:*.dz=01;31:*.gz=01;31:*.lrz=01;31:*.lz=01;31:*.lzo=01;31:*.xz=01;31:*.zst=01;31:*.tzst=01;31:*.bz2=01;31:*.bz=01;31:*.tbz=01;31:*.tbz2=01;31:*.tz=01;31:*.deb=01;31:*.rpm=01;31:*.jar=01;31:*.war=01;31:*.ear=01;31:*.sar=01;31:*.rar=01;31:*.alz=01;31:*.ace=01;31:*.zoo=01;31:*.cpio=01;31:*.7z=01;31:*.rz=01;31:*.cab=01;31:*.jpg=01;35:*.jpeg=01;35:*.mjpg=01;35:*.mjpeg=01;35:*.gif=01;35:*.bmp=01;35:*.pbm=01;35:*.pgm=01;35:*.ppm=01;35:*.tga=01;35:*.xbm=01;35:*.xpm=01;35:*.tif=01;35:*.tiff=01;35:*.png=01;35:*.svg=01;35:*.svgz=01;35:*.mng=01;35:*.pcx=01;35:*.mov=01;35:*.mpg=01;35:*.mpeg=01;35:*.m2v=01;35:*.mkv=01;35:*.webm=01;35:*.ogm=01;35:*.mp4=01;35:*.m4v=01;35:*.mp4v=01;35:*.vob=01;35:*.qt=01;35:*.nuv=01;35:*.wmv=01;35:*.asf=01;35:*.rm=01;35:*.rmvb=01;35:*.flc=01;35:*.avi=01;35:*.fli=01;35:*.flv=01;35:*.gl=01;35:*.dl=01;35:*.xcf=01;35:*.xwd=01;35:*.yuv=01;35:*.cgm=01;35:*.emf=01;35:*.ogv=01;35:*.ogx=01;35:*.aac=00;36:*.au=00;36:*.flac=00;36:*.m4a=00;36:*.mid=00;36:*.midi=00;36:*.mka=00;36:*.mp3=00;36:*.mpc=00;36:*.ogg=00;36:*.ra=00;36:*.wav=00;36:*.oga=00;36:*.opus=00;36:*.spx=00;36:*.xspf=00;36: XDG_SESSION_DESKTOP => default XAUTHORITY => /run/user/1000/gdm/Xauthority SSH_AUTH_SOCK => deleted SHELL => /bin/bash MAKE_TERMOUT => /dev/pts/1 QT_ACCESSIBILITY => 1 GDMSESSION => default GJS_DEBUG_OUTPUT => stderr GPG_AGENT_INFO => /run/user/1000/gnupg/S.gpg-agent:0:1 XDG_VTNR => 2 PWD => /www/stage/php-5.6.31 XDG_DATA_DIRS => /usr/share/gnome:/usr/local/share/:/usr/share/ SSH_CONNECTION => deleted CC => /www/stage/php-5.6.31/meta_ccld MFLAGS => VTE_VERSION => 4601 PHP Variables Variable => Value _SERVER["GJS_DEBUG_TOPICS"] => JS ERROR;JS LOG _SERVER["USER"] => jam _SERVER["SSH_CLIENT"] => deleted _SERVER["XDG_SEAT"] => seat0 _SERVER["SSH_AGENT_PID"] => 1071 _SERVER["XDG_SESSION_TYPE"] => x11 _SERVER["SHLVL"] => 2 _SERVER["TEST_PHP_SRCDIR"] => /www/stage/php-5.6.31 _SERVER["OLDPWD"] => /www/stage/php-5.6.31 _SERVER["HOME"] => /home/jam _SERVER["DESKTOP_SESSION"] => default _SERVER["SSH_TTY"] => deleted _SERVER["GTK_MODULES"] => gail:atk-bridge _SERVER["QT_LINUX_ACCESSIBILITY_ALWAYS_ON"] => 1 _SERVER["DBUS_SESSION_BUS_ADDRESS"] => unix:path=/run/user/1000/bus _SERVER["MAKEFLAGS"] => _SERVER["COLORTERM"] => truecolor _SERVER["MAKE_TERMERR"] => /dev/pts/1 _SERVER["QT_QPA_PLATFORMTHEME"] => qgnomeplatform _SERVER["LOGNAME"] => jam _SERVER["TEST_PHP_EXECUTABLE"] => /www/stage/php-5.6.31/sapi/cli/php _SERVER["JOURNAL_STREAM"] => 8:22965 _SERVER["WINDOWID"] => 31457286 _SERVER["_"] => /www/stage/php-5.6.31/sapi/cli/php _SERVER["USERNAME"] => jam _SERVER["XDG_SESSION_ID"] => 2 _SERVER["TERM"] => xterm-256color _SERVER["GNOME_DESKTOP_SESSION_ID"] => this-is-deprecated _SERVER["WINDOWPATH"] => 2 _SERVER["PATH"] => /usr/local/bin:/usr/bin:/bin:/usr/local/games:/usr/games _SERVER["GDM_LANG"] => en_US.UTF-8 _SERVER["SESSION_MANAGER"] => local/ull:@/tmp/.ICE-unix/1023,unix/ull:/tmp/.ICE-unix/1023 _SERVER["XDG_MENU_PREFIX"] => gnome- _SERVER["MAKELEVEL"] => 1 _SERVER["XDG_RUNTIME_DIR"] => /run/user/1000 _SERVER["DISPLAY"] => :0 _SERVER["LANG"] => en_US.UTF-8 _SERVER["XDG_CURRENT_DESKTOP"] => GNOME _SERVER["LS_COLORS"] => rs=0:di=01;34:ln=01;36:mh=00:pi=40;33:so=01;35:do=01;35:bd=40;33;01:cd=40;33;01:or=40;31;01:mi=00:su=37;41:sg=30;43:ca=30;41:tw=30;42:ow=34;42:st=37;44:ex=01;32:*.tar=01;31:*.tgz=01;31:*.arc=01;31:*.arj=01;31:*.taz=01;31:*.lha=01;31:*.lz4=01;31:*.lzh=01;31:*.lzma=01;31:*.tlz=01;31:*.txz=01;31:*.tzo=01;31:*.t7z=01;31:*.zip=01;31:*.z=01;31:*.Z=01;31:*.dz=01;31:*.gz=01;31:*.lrz=01;31:*.lz=01;31:*.lzo=01;31:*.xz=01;31:*.zst=01;31:*.tzst=01;31:*.bz2=01;31:*.bz=01;31:*.tbz=01;31:*.tbz2=01;31:*.tz=01;31:*.deb=01;31:*.rpm=01;31:*.jar=01;31:*.war=01;31:*.ear=01;31:*.sar=01;31:*.rar=01;31:*.alz=01;31:*.ace=01;31:*.zoo=01;31:*.cpio=01;31:*.7z=01;31:*.rz=01;31:*.cab=01;31:*.jpg=01;35:*.jpeg=01;35:*.mjpg=01;35:*.mjpeg=01;35:*.gif=01;35:*.bmp=01;35:*.pbm=01;35:*.pgm=01;35:*.ppm=01;35:*.tga=01;35:*.xbm=01;35:*.xpm=01;35:*.tif=01;35:*.tiff=01;35:*.png=01;35:*.svg=01;35:*.svgz=01;35:*.mng=01;35:*.pcx=01;35:*.mov=01;35:*.mpg=01;35:*.mpeg=01;35:*.m2v=01;35:*.mkv=01;35:*.webm=01;35:*.ogm=01;35:*.mp4=01;35:*.m4v=01;35:*.mp4v=01;35:*.vob=01;35:*.qt=01;35:*.nuv=01;35:*.wmv=01;35:*.asf=01;35:*.rm=01;35:*.rmvb=01;35:*.flc=01;35:*.avi=01;35:*.fli=01;35:*.flv=01;35:*.gl=01;35:*.dl=01;35:*.xcf=01;35:*.xwd=01;35:*.yuv=01;35:*.cgm=01;35:*.emf=01;35:*.ogv=01;35:*.ogx=01;35:*.aac=00;36:*.au=00;36:*.flac=00;36:*.m4a=00;36:*.mid=00;36:*.midi=00;36:*.mka=00;36:*.mp3=00;36:*.mpc=00;36:*.ogg=00;36:*.ra=00;36:*.wav=00;36:*.oga=00;36:*.opus=00;36:*.spx=00;36:*.xspf=00;36: _SERVER["XDG_SESSION_DESKTOP"] => default _SERVER["XAUTHORITY"] => /run/user/1000/gdm/Xauthority _SERVER["SSH_AUTH_SOCK"] => deleted _SERVER["SHELL"] => /bin/bash _SERVER["MAKE_TERMOUT"] => /dev/pts/1 _SERVER["QT_ACCESSIBILITY"] => 1 _SERVER["GDMSESSION"] => default _SERVER["GJS_DEBUG_OUTPUT"] => stderr _SERVER["GPG_AGENT_INFO"] => /run/user/1000/gnupg/S.gpg-agent:0:1 _SERVER["XDG_VTNR"] => 2 _SERVER["PWD"] => /www/stage/php-5.6.31 _SERVER["XDG_DATA_DIRS"] => /usr/share/gnome:/usr/local/share/:/usr/share/ _SERVER["SSH_CONNECTION"] => deleted _SERVER["CC"] => /www/stage/php-5.6.31/meta_ccld _SERVER["MFLAGS"] => _SERVER["VTE_VERSION"] => 4601 _SERVER["PHP_SELF"] => _SERVER["SCRIPT_NAME"] => _SERVER["SCRIPT_FILENAME"] => _SERVER["PATH_TRANSLATED"] => _SERVER["DOCUMENT_ROOT"] => _SERVER["REQUEST_TIME_FLOAT"] => 1504036021.9869 _SERVER["REQUEST_TIME"] => 1504036021 _SERVER["argv"] => Array ( ) _SERVER["argc"] => 0 _ENV["GJS_DEBUG_TOPICS"] => JS ERROR;JS LOG _ENV["USER"] => jam _ENV["SSH_CLIENT"] => deleted _ENV["XDG_SEAT"] => seat0 _ENV["SSH_AGENT_PID"] => 1071 _ENV["XDG_SESSION_TYPE"] => x11 _ENV["SHLVL"] => 2 _ENV["TEST_PHP_SRCDIR"] => /www/stage/php-5.6.31 _ENV["OLDPWD"] => /www/stage/php-5.6.31 _ENV["HOME"] => /home/jam _ENV["DESKTOP_SESSION"] => default _ENV["SSH_TTY"] => deleted _ENV["GTK_MODULES"] => gail:atk-bridge _ENV["QT_LINUX_ACCESSIBILITY_ALWAYS_ON"] => 1 _ENV["DBUS_SESSION_BUS_ADDRESS"] => unix:path=/run/user/1000/bus _ENV["MAKEFLAGS"] => _ENV["COLORTERM"] => truecolor _ENV["MAKE_TERMERR"] => /dev/pts/1 _ENV["QT_QPA_PLATFORMTHEME"] => qgnomeplatform _ENV["LOGNAME"] => jam _ENV["TEST_PHP_EXECUTABLE"] => /www/stage/php-5.6.31/sapi/cli/php _ENV["JOURNAL_STREAM"] => 8:22965 _ENV["WINDOWID"] => 31457286 _ENV["_"] => /www/stage/php-5.6.31/sapi/cli/php _ENV["USERNAME"] => jam _ENV["XDG_SESSION_ID"] => 2 _ENV["TERM"] => xterm-256color _ENV["GNOME_DESKTOP_SESSION_ID"] => this-is-deprecated _ENV["WINDOWPATH"] => 2 _ENV["PATH"] => /usr/local/bin:/usr/bin:/bin:/usr/local/games:/usr/games _ENV["GDM_LANG"] => en_US.UTF-8 _ENV["SESSION_MANAGER"] => local/ull:@/tmp/.ICE-unix/1023,unix/ull:/tmp/.ICE-unix/1023 _ENV["XDG_MENU_PREFIX"] => gnome- _ENV["MAKELEVEL"] => 1 _ENV["XDG_RUNTIME_DIR"] => /run/user/1000 _ENV["DISPLAY"] => :0 _ENV["LANG"] => en_US.UTF-8 _ENV["XDG_CURRENT_DESKTOP"] => GNOME _ENV["LS_COLORS"] => rs=0:di=01;34:ln=01;36:mh=00:pi=40;33:so=01;35:do=01;35:bd=40;33;01:cd=40;33;01:or=40;31;01:mi=00:su=37;41:sg=30;43:ca=30;41:tw=30;42:ow=34;42:st=37;44:ex=01;32:*.tar=01;31:*.tgz=01;31:*.arc=01;31:*.arj=01;31:*.taz=01;31:*.lha=01;31:*.lz4=01;31:*.lzh=01;31:*.lzma=01;31:*.tlz=01;31:*.txz=01;31:*.tzo=01;31:*.t7z=01;31:*.zip=01;31:*.z=01;31:*.Z=01;31:*.dz=01;31:*.gz=01;31:*.lrz=01;31:*.lz=01;31:*.lzo=01;31:*.xz=01;31:*.zst=01;31:*.tzst=01;31:*.bz2=01;31:*.bz=01;31:*.tbz=01;31:*.tbz2=01;31:*.tz=01;31:*.deb=01;31:*.rpm=01;31:*.jar=01;31:*.war=01;31:*.ear=01;31:*.sar=01;31:*.rar=01;31:*.alz=01;31:*.ace=01;31:*.zoo=01;31:*.cpio=01;31:*.7z=01;31:*.rz=01;31:*.cab=01;31:*.jpg=01;35:*.jpeg=01;35:*.mjpg=01;35:*.mjpeg=01;35:*.gif=01;35:*.bmp=01;35:*.pbm=01;35:*.pgm=01;35:*.ppm=01;35:*.tga=01;35:*.xbm=01;35:*.xpm=01;35:*.tif=01;35:*.tiff=01;35:*.png=01;35:*.svg=01;35:*.svgz=01;35:*.mng=01;35:*.pcx=01;35:*.mov=01;35:*.mpg=01;35:*.mpeg=01;35:*.m2v=01;35:*.mkv=01;35:*.webm=01;35:*.ogm=01;35:*.mp4=01;35:*.m4v=01;35:*.mp4v=01;35:*.vob=01;35:*.qt=01;35:*.nuv=01;35:*.wmv=01;35:*.asf=01;35:*.rm=01;35:*.rmvb=01;35:*.flc=01;35:*.avi=01;35:*.fli=01;35:*.flv=01;35:*.gl=01;35:*.dl=01;35:*.xcf=01;35:*.xwd=01;35:*.yuv=01;35:*.cgm=01;35:*.emf=01;35:*.ogv=01;35:*.ogx=01;35:*.aac=00;36:*.au=00;36:*.flac=00;36:*.m4a=00;36:*.mid=00;36:*.midi=00;36:*.mka=00;36:*.mp3=00;36:*.mpc=00;36:*.ogg=00;36:*.ra=00;36:*.wav=00;36:*.oga=00;36:*.opus=00;36:*.spx=00;36:*.xspf=00;36: _ENV["XDG_SESSION_DESKTOP"] => default _ENV["XAUTHORITY"] => /run/user/1000/gdm/Xauthority _ENV["SSH_AUTH_SOCK"] => deleted _ENV["SHELL"] => /bin/bash _ENV["MAKE_TERMOUT"] => /dev/pts/1 _ENV["QT_ACCESSIBILITY"] => 1 _ENV["GDMSESSION"] => default _ENV["GJS_DEBUG_OUTPUT"] => stderr _ENV["GPG_AGENT_INFO"] => /run/user/1000/gnupg/S.gpg-agent:0:1 _ENV["XDG_VTNR"] => 2 _ENV["PWD"] => /www/stage/php-5.6.31 _ENV["XDG_DATA_DIRS"] => /usr/share/gnome:/usr/local/share/:/usr/share/ _ENV["SSH_CONNECTION"] => deleted _ENV["CC"] => /www/stage/php-5.6.31/meta_ccld _ENV["MFLAGS"] => _ENV["VTE_VERSION"] => 4601 PHP License This program is free software; you can redistribute it and/or modify it under the terms of the PHP License as published by the PHP Group and included in the distribution in the file: LICENSE This program is distributed in the hope that it will be useful, but WITHOUT ANY WARRANTY; without even the implied warranty of MERCHANTABILITY or FITNESS FOR A PARTICULAR PURPOSE. If you did not receive a copy of the PHP license, or have any questions about PHP licensing, please contact license@php.net.