Test results [failed]

From: Date: Fri, 14 Mar 2003 14:07:45 +0000
Subject: Test results [failed]
Groups: php.qa 
Request: Send a blank email to php-qa+get-10061@lists.php.net to get a copy of this message
===================================================================== FAILED TEST SUMMARY --------------------------------------------------------------------- Bug #22367 (weird zval allocation problem) [tests/lang/bug22367.phpt] Bug #22510 (segfault among complex references) [tests/lang/bug22510.phpt] General semaphore and shared memory test [ext/sysvsem/tests/sysv.phpt] ===================================================================== ===================================================================== TEST RESULT SUMMARY --------------------------------------------------------------------- Exts skipped : 72 Exts tested : 15 --------------------------------------------------------------------- Number of tests : 469 Tests skipped : 219 (46.7%) Tests failed : 3 ( 0.6%) Tests passed : 247 (52.7%) --------------------------------------------------------------------- Time taken : 59 seconds ===================================================================== ================================================================================ /install/php-4.3.2RC1/tests/lang/bug22367.phpt ================================================================================ ---- EXPECTED OUTPUT int(5) bool(false) bool(false) array(5) { [0]=> int(0) [1]=> int(1) [2]=> int(2) [3]=> int(3) [4]=> int(4) } array(5) { [0]=> int(0) [1]=> int(1) [2]=> int(2) [3]=> int(3) [4]=> int(4) } int(2) bool(true) bool(true) array(5) { [0]=> int(0) [1]=> int(1) [2]=> int(2) [3]=> int(3) [4]=> int(4) } array(5) { [0]=> int(0) [1]=> int(1) [2]=> int(2) [3]=> int(3) [4]=> int(4) } ---- ACTUAL OUTPUT int(5) bool(false) bool(false) array(5) { [0]=> int(4) [1]=> int(4) [2]=> int(4) [3]=> int(4) [4]=> int(4) } array(5) { [0]=> int(0) [1]=> int(1) [2]=> int(2) [3]=> int(3) [4]=> int(4) } int(2) bool(true) bool(true) array(5) { [0]=> int(0) [1]=> int(1) [2]=> int(2) [3]=> int(3) [4]=> int(4) } array(5) { [0]=> int(0) [1]=> int(1) [2]=> &int(2) [3]=> int(3) [4]=> int(4) } ---- FAILED ================================================================================ 006- int(0) 006+ int(4) 008- int(1) 008+ int(4) 010- int(2) 010+ int(4) 012- int(3) 012+ int(4) 049- int(2) 049+ &int(2) ================================================================================ ================================================================================ /install/php-4.3.2RC1/tests/lang/bug22510.phpt ================================================================================ ---- EXPECTED OUTPUT ok1 bar::run1 foo::method1 foo::method1 foo::finalize done! ok2 bar::run2 foo::method2 foo::method2 foo::finalize done! ok3 bar::run3 foo::method3 foo::method3 foo::finalize done! ouch bar::run1 foo::method1 foo::method1 foo::finalize I'm alive! ---- ACTUAL OUTPUT ok1 bar::run1 foo::method1 foo::method1 foo::finalize done! ok2 bar::run2 foo::method2 foo::method2 foo::finalize done! ok3 bar::run3 foo::method3 foo::method3 foo::finalize done! ouch bar::run1 foo::method1 foo::method1 foo::finalize ---- FAILED ================================================================================ 024- I'm alive! ================================================================================ ================================================================================ /install/php-4.3.2RC1/ext/sysvsem/tests/sysv.phpt ================================================================================ ---- EXPECTED OUTPUT Start. Got semaphore Resource id #%i. Success aquire semaphore Resource id #%i. Success to attach shared memory : %i. Write var1 to shared memory. Write var2 to shared memory. Read var1=Variable 1. Read var2=Variable 2. Semaphore Resource id #%i released. Shared memory successfully removed from SysV. semaphore removed successfully from SysV. End. ---- ACTUAL OUTPUT Start. Got semaphore Resource id #4. Success aquire semaphore Resource id #4. Fatal error: Call to undefined function: shm_attach() in /install/php-4.3.2RC1/ext/sysvsem/tests/sysv.php on line 23 Warning: Releasing SysV semaphore id 4 key 0x1 in request cleanup in Unknown on line 0 ---- FAILED ================================================================================ 002- Got semaphore Resource id #%i. 002+ Got semaphore Resource id #4. 003- Success aquire semaphore Resource id #%i. 003+ Success aquire semaphore Resource id #4. 004- Success to attach shared memory : %i. 004+ 005- Write var1 to shared memory. 005+ Fatal error: Call to undefined function: shm_attach() in /install/php-4.3.2RC1/ext/sysvsem/tests/sysv.php on line 23 006- Write var2 to shared memory. 006+ 007- Read var1=Variable 1. 007+ Warning: Releasing SysV semaphore id 4 key 0x1 in request cleanup in Unknown on line 0 008- Read var2=Variable 2. 009- Semaphore Resource id #%i released. 010- Shared memory successfully removed from SysV. 011- semaphore removed successfully from SysV. 012- End. ================================================================================ ================================================================================ BUILD ENVIRONMENT ================================================================================ OS: Linux Automake: automake (GNU automake) 1.4 Copyright (C) 1999 Free Software Foundation, Inc. This is free software; see the source for copying conditions. There is NO warranty; not even for MERCHANTABILITY or FITNESS FOR A PARTICULAR PURPOSE. Written by Tom Tromey <tromey@cygnus.com> Autoconf: Autoconf version 2.13 Libtool: ltmain.sh (GNU libtool) 1.4.3 (1.922.2.110 2002/10/23 01:39:54) Compiler: Reading specs from /usr/lib/gcc-lib/i386-slackware-linux/egcs-2.91.66/specs gcc version egcs-2.91.66 19990314/Linux (egcs-1.1.2 release) Bison: GNU Bison version 1.28 User's E-mail: bojan at gajba dot net ================================================================================ PHPINFO ================================================================================ phpinfo() PHP Version => 4.3.2-RC1 System => Linux ns 2.4.20 #4 SMP Mon Feb 24 16:49:10 CET 2003 i686 Build Date => Mar 14 2003 13:48:54 Configure Command => './configure' '--with-mysql=/usr/local/mysql' '--with-gettext' '--enable-sysshm' '--enable-sysvsem' '--with-t1lib=/usr/local/include' '--with-gd' '--with-zlib' '--enable-exif' '--enable-gd-native-tt' '--with-freetype-dir=/usr/local/include/freetype' '--with-png-dir' '--with-jpeg-dir' '--with-apxs2=/www/bin/apxs' '--with-imap-ssl=/usr/local/ssl' '--with-imap=/install/imap-2002.RC3' Server API => Command Line Interface Virtual Directory Support => disabled Configuration File (php.ini) Path => /usr/local/Zend/etc/php.ini PHP API => 20020918 PHP Extension => 20020429 Zend Extension => 20021010 Debug Build => no Thread Safety => disabled Registered PHP Streams => php, http, ftp, compress.zlib This program makes use of the Zend Scripting Language Engine: Zend Engine v1.3.0, Copyright (c) 1998-2003 Zend Technologies<br /> _______________________________________________________________________ Configuration PHP Core Directive => Local Value => Master Value allow_call_time_pass_reference => Off => Off allow_url_fopen => On => On always_populate_raw_post_data => Off => Off arg_separator.input => &amp; => &amp; arg_separator.output => &amp; => &amp; asp_tags => Off => Off auto_append_file => no value => no value auto_prepend_file => no value => no value browscap => no value => no value default_charset => no value => no value default_mimetype => text/html => text/html define_syslog_variables => Off => Off disable_classes => no value => no value disable_functions => no value => no value display_errors => On => On display_startup_errors => Off => Off doc_root => no value => no value docref_ext => no value => no value docref_root => http://www.php.net/ => http://www.php.net/ enable_dl => On => On error_append_string => no value => no value error_log => no value => no value error_prepend_string => no value => no value error_reporting => 1 => 1 expose_php => Off => Off extension_dir => ./ => ./ file_uploads => On => On gpc_order => GPC => GPC highlight.bg => #FFFFFF => #FFFFFF highlight.comment => #FF8000 => #FF8000 highlight.default => #0000BB => #0000BB highlight.html => #000000 => #000000 highlight.keyword => #007700 => #007700 highlight.string => #DD0000 => #DD0000 html_errors => Off => On ignore_repeated_errors => Off => Off ignore_repeated_source => Off => Off ignore_user_abort => Off => Off implicit_flush => On => Off include_path => .:/usr/local/lib/php => .:/usr/local/lib/php log_errors => Off => Off log_errors_max_len => 1024 => 1024 magic_quotes_gpc => Off => Off magic_quotes_runtime => Off => Off magic_quotes_sybase => Off => Off max_execution_time => 0 => 30 max_input_time => 60 => 60 open_basedir => no value => no value output_buffering => 4096 => 4096 output_handler => no value => no value post_max_size => 8M => 8M precision => 14 => 14 register_argc_argv => On => Off register_globals => On => On report_memleaks => On => On safe_mode => Off => Off safe_mode_exec_dir => no value => no value safe_mode_gid => Off => Off safe_mode_include_dir => no value => no value sendmail_from => me@localhost.com => me@localhost.com sendmail_path => /usr/sbin/sendmail -t -i => /usr/sbin/sendmail -t -i short_open_tag => On => On SMTP => localhost => localhost smtp_port => 25 => 25 sql.safe_mode => Off => Off track_errors => Off => Off unserialize_callback_func => no value => no value upload_max_filesize => 2M => 2M upload_tmp_dir => no value => no value user_dir => no value => no value variables_order => GPCS => GPCS xmlrpc_error_number => 0 => 0 xmlrpc_errors => Off => Off y2k_compliance => On => On ctype ctype functions => enabled exif EXIF Support => enabled EXIF Version => 1.4 $Id: exif.c,v 1.118.2.13 2002/12/31 16:34:27 sebastian Exp $ Supported EXIF Version => 0220 Supported filetypes => JPEG,TIFF gd GD Support => enabled GD Version => bundled (2.0.11 compatible) FreeType Support => enabled FreeType Linkage => with freetype T1Lib Support => enabled GIF Read Support => enabled JPG Support => enabled PNG Support => enabled WBMP Support => enabled XBM Support => enabled gettext GetText Support => enabled imap IMAP c-Client Version => 2001 SSL Support => enabled mysql MySQL Support => enabled Active Persistent Links => 0 Active Links => 0 Client API version => 3.23.54 MYSQL_MODULE_TYPE => external MYSQL_SOCKET => /usr/local/mysql/tmp/mysql.sock MYSQL_INCLUDE => -I/usr/local/mysql/include/mysql MYSQL_LIBS => -L/usr/local/mysql/lib/mysql -lmysqlclient Directive => Local Value => Master Value mysql.allow_persistent => On => On mysql.connect_timeout => -1 => -1 mysql.default_host => no value => no value mysql.default_password => no value => no value mysql.default_port => no value => no value mysql.default_socket => no value => no value mysql.default_user => no value => no value mysql.max_links => Unlimited => Unlimited mysql.max_persistent => Unlimited => Unlimited mysql.trace_mode => Off => Off overload User-Space Object Overloading Support => enabled pcre PCRE (Perl Compatible Regular Expressions) Support => enabled PCRE Library Version => 3.92 11-Sep-2002 posix Revision => $Revision: 1.51.2.2 $ session Session Support => enabled Registered save handlers => files user Directive => Local Value => Master Value session.auto_start => Off => Off session.bug_compat_42 => Off => Off session.bug_compat_warn => On => On session.cache_expire => 180 => 180 session.cache_limiter => nocache => nocache session.cookie_domain => no value => no value session.cookie_lifetime => 0 => 0 session.cookie_path => / => / session.cookie_secure => Off => Off session.entropy_file => no value => no value session.entropy_length => 0 => 0 session.gc_dividend => 1000 => 1000 session.gc_maxlifetime => 1440 => 1440 session.gc_probability => 1 => 1 session.name => PHPSESSID => PHPSESSID session.referer_check => no value => no value session.save_handler => files => files session.save_path => /tmp => /tmp session.serialize_handler => php => php session.use_cookies => On => On session.use_only_cookies => Off => Off session.use_trans_sid => Off => Off standard Regex Library => Bundled library enabled Dynamic Library Support => enabled Path to sendmail => /usr/sbin/sendmail -t -i Directive => Local Value => Master Value assert.active => 1 => 1 assert.bail => 0 => 0 assert.callback => no value => no value assert.quiet_eval => 0 => 0 assert.warning => 1 => 1 auto_detect_line_endings => 0 => 0 default_socket_timeout => 60 => 60 safe_mode_allowed_env_vars => PHP_ => PHP_ safe_mode_protected_env_vars => LD_LIBRARY_PATH => LD_LIBRARY_PATH url_rewriter.tags => a=href,area=href,frame=src,input=src,form=fakeentry => a=href,area=href,frame=src,input=src,form=fakeentry user_agent => no value => no value tokenizer Tokenizer Support => enabled xml XML Support => active XML Namespace Support => active EXPAT Version => 1.95.2 zlib ZLib Support => enabled Compiled Version => 1.1.4 Linked Version => 1.1.4 Directive => Local Value => Master Value zlib.output_compression => Off => Off zlib.output_compression_level => -1 => -1 zlib.output_handler => no value => no value Additional Modules Module Name sysvsem Environment Variable => Value PWD => /install/php-4.3.2RC1 MAKEFLAGS => SCRIPT_FILENAME => REMOTEHOST => athlon MFLAGS => HZ => 100 HOSTNAME => ns MOZILLA_HOME => /usr/lib/netscape LS_OPTIONS => --color=auto -F -b -T 0 ignoreeof => 10 OPENWINHOME => /usr/openwin MANPATH => /usr/local/man:/usr/man/preformat:/usr/man:/usr/X11R6/man:/usr/openwin/man:/usr/share/texmf/man LESSOPEN => |lesspipe.sh %s CC => gcc LESS => -M REQUEST_METHOD => LS_COLORS => no=00:fi=00:di=01;34:ln=01;36:pi=40;33:so=01;35:bd=40;33;01:cd=40;33;01:or=40;31;01:ex=01;32:*.cmd=01;32:*.exe=01;32:*.com=01;32:*.btm=01;32:*.bat=01;32:*.tar=01;31:*.tgz=01;31:*.arj=01;31:*.taz=01;31:*.lzh=01;31:*.zip=01;31:*.bz2=01;31:*.rpm=01;31:*.deb=01;31:*.z=01;31:*.Z=01;31:*.gz=01;31:*.jpg=01;35:*.gif=01;35:*.bmp=01;35:*.ppm=01;35:*.tga=01;35:*.xbm=01;35:*.xpm=01;35:*.tif=01;35:*.mpg=01;37:*.avi=01;37:*.mov=01;37: USER => muc MACHTYPE => i386-slackware-linux-gnu TEST_PHP_SRCDIR => /install/php-4.3.2RC1 LC_ALL => POSIX PATH_TRANSLATED => EDITOR => joe QUERY_STRING => CONTENT_LENGTH => JAVA_HOME => /usr/local/jdk1.2.2/ MAKELEVEL => 1 SHLVL => 4 LOGNAME => muc HUSHLOGIN => FALSE MINICOM => -c on REDIRECT_STATUS => _ => /install/php-4.3.2RC1/sapi/cli/php TEST_PHP_EXECUTABLE => /install/php-4.3.2RC1/sapi/cli/php SHELL => /bin/sh HOSTTYPE => i386 OSTYPE => linux-gnu TERM => vt100 HOME => /root PATH => /usr/local/sbin:/usr/local/bin:/sbin:/usr/sbin:/bin:/usr/bin CONTENT_TYPE => PHP Variables Variable => Value PHP_SELF => _SERVER["PWD"] => /install/php-4.3.2RC1 _SERVER["MAKEFLAGS"] => _SERVER["SCRIPT_FILENAME"] => _SERVER["REMOTEHOST"] => athlon _SERVER["MFLAGS"] => _SERVER["HZ"] => 100 _SERVER["HOSTNAME"] => ns _SERVER["MOZILLA_HOME"] => /usr/lib/netscape _SERVER["LS_OPTIONS"] => --color=auto -F -b -T 0 _SERVER["ignoreeof"] => 10 _SERVER["OPENWINHOME"] => /usr/openwin _SERVER["MANPATH"] => /usr/local/man:/usr/man/preformat:/usr/man:/usr/X11R6/man:/usr/openwin/man:/usr/share/texmf/man _SERVER["LESSOPEN"] => |lesspipe.sh %s _SERVER["CC"] => gcc _SERVER["LESS"] => -M _SERVER["REQUEST_METHOD"] => _SERVER["LS_COLORS"] => no=00:fi=00:di=01;34:ln=01;36:pi=40;33:so=01;35:bd=40;33;01:cd=40;33;01:or=40;31;01:ex=01;32:*.cmd=01;32:*.exe=01;32:*.com=01;32:*.btm=01;32:*.bat=01;32:*.tar=01;31:*.tgz=01;31:*.arj=01;31:*.taz=01;31:*.lzh=01;31:*.zip=01;31:*.bz2=01;31:*.rpm=01;31:*.deb=01;31:*.z=01;31:*.Z=01;31:*.gz=01;31:*.jpg=01;35:*.gif=01;35:*.bmp=01;35:*.ppm=01;35:*.tga=01;35:*.xbm=01;35:*.xpm=01;35:*.tif=01;35:*.mpg=01;37:*.avi=01;37:*.mov=01;37: _SERVER["USER"] => muc _SERVER["MACHTYPE"] => i386-slackware-linux-gnu _SERVER["TEST_PHP_SRCDIR"] => /install/php-4.3.2RC1 _SERVER["LC_ALL"] => POSIX _SERVER["PATH_TRANSLATED"] => _SERVER["EDITOR"] => joe _SERVER["QUERY_STRING"] => _SERVER["CONTENT_LENGTH"] => _SERVER["JAVA_HOME"] => /usr/local/jdk1.2.2/ _SERVER["MAKELEVEL"] => 1 _SERVER["SHLVL"] => 4 _SERVER["LOGNAME"] => muc _SERVER["HUSHLOGIN"] => FALSE _SERVER["MINICOM"] => -c on _SERVER["REDIRECT_STATUS"] => _SERVER["_"] => /install/php-4.3.2RC1/sapi/cli/php _SERVER["TEST_PHP_EXECUTABLE"] => /install/php-4.3.2RC1/sapi/cli/php _SERVER["SHELL"] => /bin/sh _SERVER["HOSTTYPE"] => i386 _SERVER["OSTYPE"] => linux-gnu _SERVER["TERM"] => vt100 _SERVER["HOME"] => /root _SERVER["PATH"] => /usr/local/sbin:/usr/local/bin:/sbin:/usr/sbin:/bin:/usr/bin _SERVER["CONTENT_TYPE"] => _SERVER["PHP_SELF"] => _SERVER["SCRIPT_NAME"] => _SERVER["DOCUMENT_ROOT"] => _SERVER["argv"] => Array ( ) _SERVER["argc"] => 0 PHP License This program is free software; you can redistribute it and/or modify it under the terms of the PHP License as published by the PHP Group and included in the distribution in the file: LICENSE This program is distributed in the hope that it will be useful, but WITHOUT ANY WARRANTY; without even the implied warranty of MERCHANTABILITY or FITNESS FOR A PARTICULAR PURPOSE. If you did not receive a copy of the PHP license, or have any questions about PHP licensing, please contact license@php.net.

« previous php.qa (#10061) next »