Test results [failed]

From: Date: Fri, 14 Mar 2003 14:08:32 +0000
Subject: Test results [failed]
Groups: php.qa 
Request: Send a blank email to php-qa+get-10062@lists.php.net to get a copy of this message
===================================================================== FAILED TEST SUMMARY --------------------------------------------------------------------- Bug #22367 (weird zval allocation problem) [tests/lang/bug22367.phpt] Bug #22510 (segfault among complex references) [tests/lang/bug22510.phpt] strtotime() function [ext/standard/tests/time/002.phpt] ===================================================================== ===================================================================== TEST RESULT SUMMARY --------------------------------------------------------------------- Exts skipped : 78 Exts tested : 9 --------------------------------------------------------------------- Number of tests : 469 Tests skipped : 235 (50.1%) Tests failed : 3 ( 0.6%) Tests passed : 231 (49.3%) --------------------------------------------------------------------- Time taken : 72 seconds ===================================================================== ================================================================================ /usr/local/2install/php-4.3.2RC1/tests/lang/bug22367.phpt ================================================================================ ---- EXPECTED OUTPUT int(5) bool(false) bool(false) array(5) { [0]=> int(0) [1]=> int(1) [2]=> int(2) [3]=> int(3) [4]=> int(4) } array(5) { [0]=> int(0) [1]=> int(1) [2]=> int(2) [3]=> int(3) [4]=> int(4) } int(2) bool(true) bool(true) array(5) { [0]=> int(0) [1]=> int(1) [2]=> int(2) [3]=> int(3) [4]=> int(4) } array(5) { [0]=> int(0) [1]=> int(1) [2]=> int(2) [3]=> int(3) [4]=> int(4) } ---- ACTUAL OUTPUT int(5) bool(false) bool(false) array(5) { [0]=> int(4) [1]=> int(4) [2]=> int(4) [3]=> int(4) [4]=> int(4) } array(5) { [0]=> int(0) [1]=> int(1) [2]=> int(2) [3]=> int(3) [4]=> int(4) } int(2) bool(true) bool(true) array(5) { [0]=> int(0) [1]=> int(1) [2]=> int(2) [3]=> int(3) [4]=> int(4) } array(5) { [0]=> int(0) [1]=> int(1) [2]=> &int(2) [3]=> int(3) [4]=> int(4) } ---- FAILED ================================================================================ 006- int(0) 006+ int(4) 008- int(1) 008+ int(4) 010- int(2) 010+ int(4) 012- int(3) 012+ int(4) 049- int(2) 049+ &int(2) ================================================================================ ================================================================================ /usr/local/2install/php-4.3.2RC1/tests/lang/bug22510.phpt ================================================================================ ---- EXPECTED OUTPUT ok1 bar::run1 foo::method1 foo::method1 foo::finalize done! ok2 bar::run2 foo::method2 foo::method2 foo::finalize done! ok3 bar::run3 foo::method3 foo::method3 foo::finalize done! ouch bar::run1 foo::method1 foo::method1 foo::finalize I'm alive! ---- ACTUAL OUTPUT ok1 bar::run1 foo::method1 foo::method1 foo::finalize done! ok2 bar::run2 foo::method2 foo::method2 foo::finalize done! ok3 bar::run3 foo::method3 foo::method3 foo::finalize done! ouch bar::run1 foo::method1 foo::method1 foo::finalize ---- FAILED ================================================================================ 024- I'm alive! ================================================================================ ================================================================================ /usr/local/2install/php-4.3.2RC1/ext/standard/tests/time/002.phpt ================================================================================ ---- EXPECTED OUTPUT 1999-10-13 00:00:00 1999-10-13 00:00:00 2000-01-19 00:00:00 2000-01-19 00:00:00 2001-12-21 00:00:00 2001-12-21 00:00:00 2001-12-21 12:16:00 2001-12-21 12:16:00 1969-12-31 23:59:59 2001-10-22 21:19:58 2001-10-22 23:19:58 2001-10-22 23:32:58 2001-10-22 19:19:58 2001-10-22 19:06:58 1999-10-13 00:00:00 1999-10-13 00:00:00 2000-01-19 00:00:00 2000-01-19 00:00:00 2001-12-21 00:00:00 2001-12-21 00:00:00 2001-12-21 12:16:00 2001-12-21 12:16:00 1970-01-01 00:59:59 2001-10-22 21:19:58 2001-10-23 01:19:58 2001-10-23 01:32:58 2001-10-22 21:19:58 2001-10-22 21:06:58 ---- ACTUAL OUTPUT 1999-10-13 00:00:00 1999-10-13 00:00:00 2000-01-19 00:00:00 2000-01-19 00:00:00 2001-12-21 00:00:00 2001-12-21 00:00:00 2001-12-21 12:16:00 2001-12-21 12:16:00 1969-12-31 23:59:59 2001-10-22 21:19:58 2001-10-22 23:19:58 2001-10-22 23:32:58 2001-10-22 19:19:58 2001-10-22 19:06:58 1999-10-13 00:00:00 1999-10-13 00:00:00 2000-01-19 00:00:00 2000-01-19 00:00:00 2001-12-21 00:00:00 2001-12-21 00:00:00 2001-12-21 12:16:00 2001-12-21 12:16:00 1969-12-31 23:59:59 2001-10-22 21:19:58 2001-10-22 23:19:58 2001-10-22 23:32:58 2001-10-22 19:19:58 2001-10-22 19:06:58 ---- FAILED ================================================================================ 023- 1970-01-01 00:59:59 023+ 1969-12-31 23:59:59 025- 2001-10-23 01:19:58 025+ 2001-10-22 23:19:58 026- 2001-10-23 01:32:58 026+ 2001-10-22 23:32:58 027- 2001-10-22 21:19:58 027+ 2001-10-22 19:19:58 028- 2001-10-22 21:06:58 028+ 2001-10-22 19:06:58 ================================================================================ ================================================================================ BUILD ENVIRONMENT ================================================================================ OS: IRIX64 Automake: automake (GNU automake) 1.4a Copyright (C) 2000 Free Software Foundation, Inc. This is free software; see the source for copying conditions. There is NO warranty; not even for MERCHANTABILITY or FITNESS FOR A PARTICULAR PURPOSE. Written by Tom Tromey <tromey@cygnus.com> Autoconf: autoconf (GNU autoconf) 2.49b Written by David J. MacKenzie. Copyright (C) 1992, 93, 94, 96, 99, 2000 Free Software Foundation, Inc. This is free software; see the source for copying conditions. There is NO warranty; not even for MERCHANTABILITY or FITNESS FOR A PARTICULAR PURPOSE. Libtool: ltmain.sh (GNU libtool) 1.4.3 (1.922.2.110 2002/10/23 01:39:54) Compiler: N/A Bison: GNU Bison version 1.25 User's E-mail: barrosf at inmet dot gov dot br ================================================================================ PHPINFO ================================================================================ phpinfo() PHP Version => 4.3.2-RC1 System => IRIX64 challenge 6.5 07121149 IP25 Build Date => Mar 14 2003 11:02:28 Configure Command => './configure' '--with-apxs=/usr/local/apache/bin/apxs' Server API => Command Line Interface Virtual Directory Support => disabled Configuration File (php.ini) Path => /usr/local/lib PHP API => 20020918 PHP Extension => 20020429 Zend Extension => 20021010 Debug Build => no Thread Safety => disabled Registered PHP Streams => php, http, ftp This program makes use of the Zend Scripting Language Engine: Zend Engine v1.3.0, Copyright (c) 1998-2003 Zend Technologies<br /> _______________________________________________________________________ Configuration PHP Core Directive => Local Value => Master Value allow_call_time_pass_reference => On => On allow_url_fopen => On => On always_populate_raw_post_data => Off => Off arg_separator.input => &amp; => &amp; arg_separator.output => &amp; => &amp; asp_tags => Off => Off auto_append_file => no value => no value auto_prepend_file => no value => no value browscap => no value => no value default_charset => no value => no value default_mimetype => text/html => text/html define_syslog_variables => Off => Off disable_classes => no value => no value disable_functions => no value => no value display_errors => On => On display_startup_errors => Off => Off doc_root => no value => no value docref_ext => no value => no value docref_root => http://www.php.net/ => http://www.php.net/ enable_dl => On => On error_append_string => no value => no value error_log => no value => no value error_prepend_string => no value => no value error_reporting => no value => no value expose_php => On => On extension_dir => /usr/local/lib/php/extensions/no-debug-non-zts-20020429 => /usr/local/lib/php/extensions/no-debug-non-zts-20020429 file_uploads => On => On gpc_order => GPC => GPC highlight.bg => #FFFFFF => #FFFFFF highlight.comment => #FF8000 => #FF8000 highlight.default => #0000BB => #0000BB highlight.html => #000000 => #000000 highlight.keyword => #007700 => #007700 highlight.string => #DD0000 => #DD0000 html_errors => Off => On ignore_repeated_errors => Off => Off ignore_repeated_source => Off => Off ignore_user_abort => Off => Off implicit_flush => On => Off include_path => .:/usr/local/lib/php => .:/usr/local/lib/php log_errors => Off => Off log_errors_max_len => 1024 => 1024 magic_quotes_gpc => On => On magic_quotes_runtime => Off => Off magic_quotes_sybase => Off => Off max_execution_time => 0 => 30 max_input_time => -1 => -1 open_basedir => no value => no value output_buffering => 0 => 0 output_handler => no value => no value post_max_size => 8M => 8M precision => 14 => 14 register_argc_argv => On => On register_globals => Off => Off report_memleaks => On => On safe_mode => Off => Off safe_mode_exec_dir => no value => no value safe_mode_gid => Off => Off safe_mode_include_dir => no value => no value sendmail_from => no value => no value sendmail_path => /usr/lib/sendmail -t -i => /usr/lib/sendmail -t -i short_open_tag => On => On SMTP => localhost => localhost smtp_port => 25 => 25 sql.safe_mode => Off => Off track_errors => Off => Off unserialize_callback_func => no value => no value upload_max_filesize => 2M => 2M upload_tmp_dir => no value => no value user_dir => no value => no value variables_order => no value => no value xmlrpc_error_number => 0 => 0 xmlrpc_errors => Off => Off y2k_compliance => On => On ctype ctype functions => enabled mysql MySQL Support => enabled Active Persistent Links => 0 Active Links => 0 Client API version => 3.23.49 MYSQL_MODULE_TYPE => builtin MYSQL_SOCKET => /tmp/mysql.sock MYSQL_INCLUDE => MYSQL_LIBS => Directive => Local Value => Master Value mysql.allow_persistent => On => On mysql.connect_timeout => -1 => -1 mysql.default_host => no value => no value mysql.default_password => no value => no value mysql.default_port => no value => no value mysql.default_socket => no value => no value mysql.default_user => no value => no value mysql.max_links => Unlimited => Unlimited mysql.max_persistent => Unlimited => Unlimited mysql.trace_mode => Off => Off overload User-Space Object Overloading Support => enabled pcre PCRE (Perl Compatible Regular Expressions) Support => enabled PCRE Library Version => 3.92 11-Sep-2002 posix Revision => $Revision: 1.51.2.2 $ session Session Support => enabled Registered save handlers => files user Directive => Local Value => Master Value session.auto_start => Off => Off session.bug_compat_42 => On => On session.bug_compat_warn => On => On session.cache_expire => 180 => 180 session.cache_limiter => nocache => nocache session.cookie_domain => no value => no value session.cookie_lifetime => 0 => 0 session.cookie_path => / => / session.cookie_secure => Off => Off session.entropy_file => no value => no value session.entropy_length => 0 => 0 session.gc_dividend => 100 => 100 session.gc_maxlifetime => 1440 => 1440 session.gc_probability => 1 => 1 session.name => PHPSESSID => PHPSESSID session.referer_check => no value => no value session.save_handler => files => files session.save_path => /tmp => /tmp session.serialize_handler => php => php session.use_cookies => On => On session.use_only_cookies => Off => Off session.use_trans_sid => Off => Off standard Regex Library => Bundled library enabled Dynamic Library Support => enabled Path to sendmail => /usr/lib/sendmail -t -i Directive => Local Value => Master Value assert.active => 1 => 1 assert.bail => 0 => 0 assert.callback => no value => no value assert.quiet_eval => 0 => 0 assert.warning => 1 => 1 auto_detect_line_endings => 0 => 0 default_socket_timeout => 60 => 60 safe_mode_allowed_env_vars => PHP_ => PHP_ safe_mode_protected_env_vars => LD_LIBRARY_PATH => LD_LIBRARY_PATH url_rewriter.tags => a=href,area=href,frame=src,form=,fieldset= => a=href,area=href,frame=src,form=,fieldset= user_agent => no value => no value tokenizer Tokenizer Support => enabled xml XML Support => active XML Namespace Support => active EXPAT Version => 1.95.2 Additional Modules Module Name Environment Variable => Value _ => /usr/local/2install/php-4.3.2RC1/sapi/cli/php LANG => C HZ => 100 QUERY_STRING => PATH => /usr/local/lsf/bin:/usr/local/lsf/etc:/usr/freeware/bin:/usr/sbin:/usr/bsd:/sbin:/usr/bin:/etc:/usr/etc:/usr/bin/X11 SCRIPT_FILENAME => CONTENT_TYPE => NOMSGLABEL => 1 REMOTEUSER => UNKNOWN LOGNAME => root REDIRECT_STATUS => MAKEFLAGS => MAIL => /usr/mail/root PS1 => challenge:$PWD> REQUEST_METHOD => USER => root PATH_TRANSLATED => MSGVERB => text:action CC => cc CONTENT_LENGTH => DISPLAY => ndpncap.inmet.gov.br:0 MAKELEVEL => 1 TEST_PHP_EXECUTABLE => /usr/local/2install/php-4.3.2RC1/sapi/cli/php SHELL => /bin/sh REMOTEHOST => ndpncap.inmet.gov.br HOME => / TEST_PHP_SRCDIR => /usr/local/2install/php-4.3.2RC1 TERM => iris-ansi MFLAGS => PWD => /usr/local/2install/php-4.3.2RC1 TZ => EST3 LSF_ENVDIR => /usr/local/lsf/mnt/conf NOMSGSEVERITY => 1 PHP Variables Variable => Value _SERVER["_"] => /usr/local/2install/php-4.3.2RC1/sapi/cli/php _SERVER["LANG"] => C _SERVER["HZ"] => 100 _SERVER["QUERY_STRING"] => _SERVER["PATH"] => /usr/local/lsf/bin:/usr/local/lsf/etc:/usr/freeware/bin:/usr/sbin:/usr/bsd:/sbin:/usr/bin:/etc:/usr/etc:/usr/bin/X11 _SERVER["SCRIPT_FILENAME"] => _SERVER["CONTENT_TYPE"] => _SERVER["NOMSGLABEL"] => 1 _SERVER["REMOTEUSER"] => UNKNOWN _SERVER["LOGNAME"] => root _SERVER["REDIRECT_STATUS"] => _SERVER["MAKEFLAGS"] => _SERVER["MAIL"] => /usr/mail/root _SERVER["PS1"] => challenge:$PWD> _SERVER["REQUEST_METHOD"] => _SERVER["USER"] => root _SERVER["PATH_TRANSLATED"] => _SERVER["MSGVERB"] => text:action _SERVER["CC"] => cc _SERVER["CONTENT_LENGTH"] => _SERVER["DISPLAY"] => ndpncap.inmet.gov.br:0 _SERVER["MAKELEVEL"] => 1 _SERVER["TEST_PHP_EXECUTABLE"] => /usr/local/2install/php-4.3.2RC1/sapi/cli/php _SERVER["SHELL"] => /bin/sh _SERVER["REMOTEHOST"] => ndpncap.inmet.gov.br _SERVER["HOME"] => / _SERVER["TEST_PHP_SRCDIR"] => /usr/local/2install/php-4.3.2RC1 _SERVER["TERM"] => iris-ansi _SERVER["MFLAGS"] => _SERVER["PWD"] => /usr/local/2install/php-4.3.2RC1 _SERVER["TZ"] => EST3 _SERVER["LSF_ENVDIR"] => /usr/local/lsf/mnt/conf _SERVER["NOMSGSEVERITY"] => 1 _SERVER["PHP_SELF"] => _SERVER["SCRIPT_NAME"] => _SERVER["DOCUMENT_ROOT"] => _SERVER["argv"] => Array ( ) _SERVER["argc"] => 0 _ENV["_"] => /usr/local/2install/php-4.3.2RC1/sapi/cli/php _ENV["LANG"] => C _ENV["HZ"] => 100 _ENV["QUERY_STRING"] => _ENV["PATH"] => /usr/local/lsf/bin:/usr/local/lsf/etc:/usr/freeware/bin:/usr/sbin:/usr/bsd:/sbin:/usr/bin:/etc:/usr/etc:/usr/bin/X11 _ENV["SCRIPT_FILENAME"] => _ENV["CONTENT_TYPE"] => _ENV["NOMSGLABEL"] => 1 _ENV["REMOTEUSER"] => UNKNOWN _ENV["LOGNAME"] => root _ENV["REDIRECT_STATUS"] => _ENV["MAKEFLAGS"] => _ENV["MAIL"] => /usr/mail/root _ENV["PS1"] => challenge:$PWD> _ENV["REQUEST_METHOD"] => _ENV["USER"] => root _ENV["PATH_TRANSLATED"] => _ENV["MSGVERB"] => text:action _ENV["CC"] => cc _ENV["CONTENT_LENGTH"] => _ENV["DISPLAY"] => ndpncap.inmet.gov.br:0 _ENV["MAKELEVEL"] => 1 _ENV["TEST_PHP_EXECUTABLE"] => /usr/local/2install/php-4.3.2RC1/sapi/cli/php _ENV["SHELL"] => /bin/sh _ENV["REMOTEHOST"] => ndpncap.inmet.gov.br _ENV["HOME"] => / _ENV["TEST_PHP_SRCDIR"] => /usr/local/2install/php-4.3.2RC1 _ENV["TERM"] => iris-ansi _ENV["MFLAGS"] => _ENV["PWD"] => /usr/local/2install/php-4.3.2RC1 _ENV["TZ"] => EST3 _ENV["LSF_ENVDIR"] => /usr/local/lsf/mnt/conf _ENV["NOMSGSEVERITY"] => 1 PHP License This program is free software; you can redistribute it and/or modify it under the terms of the PHP License as published by the PHP Group and included in the distribution in the file: LICENSE This program is distributed in the hope that it will be useful, but WITHOUT ANY WARRANTY; without even the implied warranty of MERCHANTABILITY or FITNESS FOR A PARTICULAR PURPOSE. If you did not receive a copy of the PHP license, or have any questions about PHP licensing, please contact license@php.net.

« previous php.qa (#10062) next »