Test results for PHP-4.3.2RC2 on Tru64 (only the first part)
| From: | Michael Mauch | Date: | Wed, 30 Apr 2003 16:27:05 +0000 |
| Subject: | Test results for PHP-4.3.2RC2 on Tru64 (only the first part) | ||
| Groups: | php.qa | ||
| Request: | Send a blank email to php-qa+get-11904@lists.php.net to get a copy of this message | ||
Hi,
the original test report was more than 900 KB, gzipped still 104 KB, so
it was returned to me.
tests/lang/023.phpt seems a bit verbose, so I snipped the results a bit
and marked that with "[ snipped about 20000 lines here ]".
Regards...
Michael
=====================================================================
FAILED TEST SUMMARY
---------------------------------------------------------------------
Regression test [tests/lang/023.phpt]
Looped regression test (may take a while) [tests/lang/024.phpt]
Simple math tests [ext/standard/tests/math/abs.phpt]
log() tests [ext/standard/tests/math/log.phpt]
Various pow() tests [ext/standard/tests/math/pow.phpt]
Simple math tests [ext/standard/tests/math/round.phpt]
microtime() function [ext/standard/tests/time/001.phpt]
strtotime() function [ext/standard/tests/time/002.phpt]
mktime() [ext/standard/tests/time/mktime.phpt]
=====================================================================
=====================================================================
TEST RESULT SUMMARY
---------------------------------------------------------------------
Exts skipped : 77
Exts tested : 10
---------------------------------------------------------------------
Number of tests : 469
Tests skipped : 238 (50.7%)
Tests failed : 9 ( 1.9%)
Tests passed : 222 (47.3%)
---------------------------------------------------------------------
Time taken : 2072 seconds
=====================================================================
================================================================================
/house/elmicha/local/src/php-4.3.2RC2/tests/lang/023.phpt
================================================================================
---- EXPECTED OUTPUT
PHP Regression Test
<html>
<head>
*** Testing assignments and variable aliasing: ***<br>
This should read "blah": blah<br>
This should read "this is nifty": this is nifty<br>
*************************************************<br>
*** Testing integer operators ***<br>
Correct result - 8: 8<br>
Correct result - 8: 8<br>
Correct result - 2: 2<br>
Correct result - -2: -2<br>
Correct result - 15: 15<br>
Correct result - 15: 15<br>
Correct result - 2: 2<br>
Correct result - 3: 3<br>
*********************************<br>
*** Testing real operators ***<br>
Correct result - 8: 8<br>
Correct result - 8: 8<br>
Correct result - 2: 2<br>
Correct result - -2: -2<br>
Correct result - 15: 15<br>
Correct result - 15: 15<br>
Correct result - 2: 2<br>
Correct result - 3: 3<br>
*********************************<br>
*** Testing if/elseif/else control ***<br>
This works<br>
this_still_works<br>
should_print<br>
*** Seriously nested if's test ***<br>
** spelling correction by kluzz **
Only two lines of text should follow:<br>
this should be displayed. should be: $i=1, $j=0. is: $i=1, $j=0<br>
this is supposed to be displayed. should be: $i=2, $j=4. is: $i=2, $j=4<br>
3 loop iterations should follow:<br>
2 4<br>
3 4<br>
4 4<br>
**********************************<br>
*** C-style else-if's ***<br>
This should be displayed<br>
*************************<br>
*** WHILE tests ***<br>
0 is smaller than 20<br>
1 is smaller than 20<br>
2 is smaller than 20<br>
3 is smaller than 20<br>
4 is smaller than 20<br>
5 is smaller than 20<br>
6 is smaller than 20<br>
7 is smaller than 20<br>
8 is smaller than 20<br>
9 is smaller than 20<br>
10 is smaller than 20<br>
11 is smaller than 20<br>
12 is smaller than 20<br>
13 is smaller than 20<br>
14 is smaller than 20<br>
15 is smaller than 20<br>
16 is smaller than 20<br>
17 is smaller than 20<br>
18 is smaller than 20<br>
19 is smaller than 20<br>
20 equals 20<br>
21 is greater than 20<br>
22 is greater than 20<br>
23 is greater than 20<br>
24 is greater than 20<br>
25 is greater than 20<br>
26 is greater than 20<br>
27 is greater than 20<br>
28 is greater than 20<br>
29 is greater than 20<br>
30 is greater than 20<br>
31 is greater than 20<br>
32 is greater than 20<br>
33 is greater than 20<br>
34 is greater than 20<br>
35 is greater than 20<br>
36 is greater than 20<br>
37 is greater than 20<br>
38 is greater than 20<br>
39 is greater than 20<br>
*******************<br>
*** Nested WHILEs ***<br>
Each array variable should be equal to the sum of its indices:<br>
${test00}[0] = 0<br>
${test00}[1] = 1<br>
${test00}[2] = 2<br>
${test01}[0] = 1<br>
${test01}[1] = 2<br>
${test01}[2] = 3<br>
${test02}[0] = 2<br>
${test02}[1] = 3<br>
${test02}[2] = 4<br>
${test10}[0] = 1<br>
${test10}[1] = 2<br>
${test10}[2] = 3<br>
${test11}[0] = 2<br>
${test11}[1] = 3<br>
${test11}[2] = 4<br>
${test12}[0] = 3<br>
${test12}[1] = 4<br>
${test12}[2] = 5<br>
${test20}[0] = 2<br>
${test20}[1] = 3<br>
${test20}[2] = 4<br>
${test21}[0] = 3<br>
${test21}[1] = 4<br>
${test21}[2] = 5<br>
${test22}[0] = 4<br>
${test22}[1] = 5<br>
${test22}[2] = 6<br>
*********************<br>
*** hash test... ***<br>
commented out...
**************************<br>
*** Hash resizing test ***<br>
ba<br>
baa<br>
baaa<br>
baaaa<br>
baaaaa<br>
baaaaaa<br>
baaaaaaa<br>
baaaaaaaa<br>
baaaaaaaaa<br>
baaaaaaaaaa<br>
ba<br>
10<br>
baa<br>
9<br>
baaa<br>
8<br>
baaaa<br>
7<br>
baaaaa<br>
6<br>
baaaaaa<br>
5<br>
baaaaaaa<br>
4<br>
baaaaaaaa<br>
3<br>
baaaaaaaaa<br>
2<br>
baaaaaaaaaa<br>
1<br>
**************************<br>
*** break/continue test ***<br>
$i should go from 0 to 2<br>
$j should go from 3 to 4, and $q should go from 3 to 4<br>
$j=3<br>
$q=3<br>
$q=4<br>
$j=4<br>
$q=3<br>
$q=4<br>
$j should go from 0 to 2<br>
$j=0<br>
$j=1<br>
$j=2<br>
$k should go from 0 to 2<br>
$k=0<br>
$k=1<br>
$k=2<br>
$i=0<br>
$j should go from 3 to 4, and $q should go from 3 to 4<br>
$j=3<br>
$q=3<br>
$q=4<br>
$j=4<br>
$q=3<br>
$q=4<br>
$j should go from 0 to 2<br>
$j=0<br>
$j=1<br>
$j=2<br>
$k should go from 0 to 2<br>
$k=0<br>
$k=1<br>
$k=2<br>
$i=1<br>
$j should go from 3 to 4, and $q should go from 3 to 4<br>
$j=3<br>
$q=3<br>
$q=4<br>
$j=4<br>
$q=3<br>
$q=4<br>
$j should go from 0 to 2<br>
$j=0<br>
$j=1<br>
$j=2<br>
$k should go from 0 to 2<br>
$k=0<br>
$k=1<br>
$k=2<br>
$i=2<br>
***********************<br>
*** Nested file include test ***<br>
<html>
This is Finish.phtml. This file is supposed to be included
from regression_test.phtml. This is normal HTML.
and this is PHP code, 2+2=4
</html>
********************************<br>
Tests completed.<br>
Limor Ullmann is now Limor Baruch :I
---- ACTUAL OUTPUT
PHP Regression Test
<html>
<head>
*** Testing assignments and variable aliasing: ***<br>
This should read "blah": blah<br>
This should read "this is nifty": this is nifty<br>
*************************************************<br>
*** Testing integer operators ***<br>
Correct result - 8: 8<br>
Correct result - 8: 8<br>
Correct result - 2: 2<br>
Correct result - -2: -2<br>
Correct result - 15: 15<br>
Correct result - 15: 15<br>
Correct result - 2: 2<br>
Correct result - 3: 3<br>
*********************************<br>
*** Testing real operators ***<br>
Correct result - 8: 8<br>
Correct result - 8: 8<br>
Correct result - 2: 2<br>
Correct result - -2: -2<br>
Correct result - 15: 15<br>
Correct result - 15: 15<br>
Correct result - 2: 2<br>
Correct result - 3: 3<br>
*********************************<br>
*** Testing if/elseif/else control ***<br>
This works<br>
this_still_works<br>
should_print<br>
*** Seriously nested if's test ***<br>
** spelling correction by kluzz **
Only two lines of text should follow:<br>
this should be displayed. should be: $i=1, $j=0. is: $i=1, $j=0<br>
this is supposed to be displayed. should be: $i=2, $j=4. is: $i=2,
$j=-9214364837600034816<br>
3 loop iterations should follow:<br>
**********************************<br>
*** C-style else-if's ***<br>
This should be displayed<br>
*************************<br>
*** WHILE tests ***<br>
0 is smaller than 20<br>
1 is smaller than 20<br>
2 is smaller than 20<br>
3 is smaller than 20<br>
4 is smaller than 20<br>
5 is smaller than 20<br>
6 is smaller than 20<br>
7 is smaller than 20<br>
8 is smaller than 20<br>
9 is smaller than 20<br>
10 is smaller than 20<br>
11 is smaller than 20<br>
12 is smaller than 20<br>
13 is smaller than 20<br>
14 is smaller than 20<br>
15 is smaller than 20<br>
16 is smaller than 20<br>
17 is smaller than 20<br>
18 is smaller than 20<br>
19 is smaller than 20<br>
20 equals 20<br>
21 is greater than 20<br>
22 is greater than 20<br>
23 is greater than 20<br>
24 is greater than 20<br>
25 is greater than 20<br>
26 is greater than 20<br>
27 is greater than 20<br>
28 is greater than 20<br>
29 is greater than 20<br>
30 is greater than 20<br>
31 is greater than 20<br>
32 is greater than 20<br>
33 is greater than 20<br>
34 is greater than 20<br>
35 is greater than 20<br>
36 is greater than 20<br>
37 is greater than 20<br>
38 is greater than 20<br>
39 is greater than 20<br>
*******************<br>
*** Nested WHILEs ***<br>
Each array variable should be equal to the sum of its indices:<br>
${test00}[0] = 0<br>
${test00}[1] = 1<br>
${test00}[2] = 2<br>
${test01}[0] = 1<br>
${test01}[1] = 2<br>
${test01}[2] = 3<br>
${test02}[0] = 2<br>
${test02}[1] = 3<br>
${test02}[2] = 4<br>
${test10}[0] = 1<br>
${test10}[1] = 2<br>
${test10}[2] = 3<br>
${test11}[0] = 2<br>
${test11}[1] = 3<br>
${test11}[2] = 4<br>
${test12}[0] = 3<br>
${test12}[1] = 4<br>
${test12}[2] = 5<br>
${test20}[0] = 2<br>
${test20}[1] = 3<br>
${test20}[2] = 4<br>
${test21}[0] = 3<br>
${test21}[1] = 4<br>
${test21}[2] = 5<br>
${test22}[0] = 4<br>
${test22}[1] = 5<br>
${test22}[2] = 6<br>
*********************<br>
*** hash test... ***<br>
commented out...
**************************<br>
*** Hash resizing test ***<br>
ba<br>
baa<br>
baaa<br>
baaaa<br>
baaaaa<br>
baaaaaa<br>
baaaaaaa<br>
baaaaaaaa<br>
baaaaaaaaa<br>
baaaaaaaaaa<br>
ba<br>
10<br>
baa<br>
9<br>
baaa<br>
8<br>
baaaa<br>
7<br>
baaaaa<br>
6<br>
baaaaaa<br>
5<br>
baaaaaaa<br>
4<br>
baaaaaaaa<br>
3<br>
baaaaaaaaa<br>
2<br>
baaaaaaaaaa<br>
1<br>
**************************<br>
*** break/continue test ***<br>
$i should go from 0 to 2<br>
$j should go from 3 to 4, and $q should go from 3 to 4<br>
$j=3<br>
$q=3<br>
$q=4<br>
$j=4<br>
$q=3<br>
$q=4<br>
$j should go from 0 to 2<br>
$j=0<br>
$j=1<br>
$j=2<br>
$k should go from 0 to 2<br>
$k=0<br>
$k=1<br>
$k=2<br>
$i=0<br>
$j should go from 3 to 4, and $q should go from 3 to 4<br>
$j=3<br>
$q=3<br>
$q=4<br>
$j=4<br>
$q=3<br>
$q=4<br>
$j should go from 0 to 2<br>
$j=0<br>
$j=1<br>
$j=2<br>
$k should go from 0 to 2<br>
$k=0<br>
$k=1<br>
$k=2<br>
$i=1<br>
$j should go from 3 to 4, and $q should go from 3 to 4<br>
$j=3<br>
$q=3<br>
$q=4<br>
$j=4<br>
$q=3<br>
$q=4<br>
$j should go from 0 to 2<br>
$j=0<br>
$j=1<br>
$j=2<br>
$k should go from 0 to 2<br>
$k=0<br>
$k=1<br>
$k=2<br>
$i=2<br>
***********************<br>
*** Nested file include test ***<br>
<html>
This is Finish.phtml. This file is supposed to be included
from regression_test.phtml. This is normal HTML.
and this is PHP code, 2+2=4
</html>
********************************<br>
Tests completed.<br>
[ snipped about 20000 lines here ]
---- FAILED
================================================================================
041- this is supposed to be displayed. should be: $i=2, $j=4. is: $i=2, $j=4
041+ this is supposed to be displayed. should be: $i=2, $j=4. is: $i=2, $j=-9214364837600034816
043- 2 4
043+ **********************************
044- 3 4
044+
045- 4 4
045+ *** C-style else-if's ***
046- **********************************
046+ This should be displayed
047-
047+ *************************
048- *** C-style else-if's ***
048+
049- This should be displayed
049+ *** WHILE tests ***
050- *************************
050+ 0 is smaller than 20
051-
051+ 1 is smaller than 20
052- *** WHILE tests ***
052+ 2 is smaller than 20
053- 0 is smaller than 20
053+ 3 is smaller than 20
054- 1 is smaller than 20
054+ 4 is smaller than 20
055- 2 is smaller than 20
055+ 5 is smaller than 20
056- 3 is smaller than 20
056+ 6 is smaller than 20
057- 4 is smaller than 20
057+ 7 is smaller than 20
058- 5 is smaller than 20
058+ 8 is smaller than 20
059- 6 is smaller than 20
059+ 9 is smaller than 20
060- 7 is smaller than 20
060+ 10 is smaller than 20
[ snipped about 20000 lines here ]
================================================================================
/house/elmicha/local/src/php-4.3.2RC2/ext/standard/tests/math/abs.phpt
================================================================================
---- EXPECTED OUTPUT
1,1,0,0
OK
---- ACTUAL OUTPUT
1,1,1,1
Assert failed:
-LONG_MIN+1 === abs(LONG_MIN-1)
Left: int(-9223372036854775807)
Right: int(9223372036854775807)
Assert failed:
-LONG_MIN === abs(LONG_MIN)
Left: int(-9223372036854775808)
Right: float(9.2233720368548E+18)
---- FAILED
================================================================================
001- 1,1,0,0
001+ 1,1,1,1
002- OK
002+
003+ Assert failed:
004+ -LONG_MIN+1 === abs(LONG_MIN-1)
005+ Left: int(-9223372036854775807)
006+ Right: int(9223372036854775807)
007+
008+ Assert failed:
009+ -LONG_MIN === abs(LONG_MIN)
010+ Left: int(-9223372036854775808)
011+ Right: float(9.2233720368548E+18)
================================================================================
================================================================================
/house/elmicha/local/src/php-4.3.2RC2/ext/standard/tests/math/log.phpt
================================================================================
---- EXPECTED OUTPUT
On failure, please mail result to php-dev@lists.php.net
200
50
50
50
50
50
50
50
50
50
---- ACTUAL OUTPUT
On failure, please mail result to php-dev@lists.php.net
200
---- FAILED
================================================================================
003- 50
004- 50
005- 50
006- 50
007- 50
008- 50
009- 50
010- 50
011- 50
================================================================================
================================================================================
/house/elmicha/local/src/php-4.3.2RC2/ext/standard/tests/math/pow.phpt
================================================================================
---- EXPECTED OUTPUT
1,1,0,0
On failure, please mail result to php-dev@lists.php.net
OK
---- ACTUAL OUTPUT
1,1,1,1
On failure, please mail result to php-dev@lists.php.net
Assert failed:
TRUE === is_infinite(pow(0,-2))
Left: bool(true)
Right: bool(false)
Assert failed:
TRUE === is_infinite(pow(0,-1))
Left: bool(true)
Right: bool(false)
Assert failed:
TRUE === is_infinite(pow(0,-2.0))
Left: bool(true)
Right: bool(false)
Assert failed:
TRUE === is_infinite(pow(0,-1.0))
Left: bool(true)
Right: bool(false)
Assert failed:
TRUE === is_infinite(pow(0.0,-2.0))
Left: bool(true)
Right: bool(false)
Assert failed:
TRUE === is_infinite(pow(0.0,-1.0))
Left: bool(true)
Right: bool(false)
Assert failed:
TRUE === is_infinite(pow( 0.0,-2))
Left: bool(true)
Right: bool(false)
Assert failed:
TRUE === is_infinite(pow( 0.0,-1))
Left: bool(true)
Right: bool(false)
Assert failed:
LONG_MAX-1 === pow(LONG_MAX-1,1)
Left: int(9223372036854775806)
Right: int(-9223372036854775808)
Assert failed:
LONG_MIN+1 === pow(LONG_MIN+1,1)
Left: int(-9223372036854775807)
Right: int(-9223372036854775808)
Assert failed:
LONG_MAX === pow(LONG_MAX,1)
Left: int(9223372036854775807)
Right: int(-9223372036854775808)
---- FAILED
================================================================================
001- 1,1,0,0
001+ 1,1,1,1
003- OK
003+
004+ Assert failed:
005+ TRUE === is_infinite(pow(0,-2))
006+ Left: bool(true)
007+ Right: bool(false)
008+
009+ Assert failed:
010+ TRUE === is_infinite(pow(0,-1))
011+ Left: bool(true)
012+ Right: bool(false)
013+
014+ Assert failed:
015+ TRUE === is_infinite(pow(0,-2.0))
016+ Left: bool(true)
017+ Right: bool(false)
018+
019+ Assert failed:
020+ TRUE === is_infinite(pow(0,-1.0))
021+ Left: bool(true)
022+ Right: bool(false)
023+
024+ Assert failed:
025+ TRUE === is_infinite(pow(0.0,-2.0))
026+ Left: bool(true)
027+ Right: bool(false)
028+
029+ Assert failed:
030+ TRUE === is_infinite(pow(0.0,-1.0))
031+ Left: bool(true)
032+ Right: bool(false)
033+
034+ Assert failed:
035+ TRUE === is_infinite(pow( 0.0,-2))
036+ Left: bool(true)
037+ Right: bool(false)
038+
039+ Assert failed:
040+ TRUE === is_infinite(pow( 0.0,-1))
041+ Left: bool(true)
042+ Right: bool(false)
043+
044+ Assert failed:
045+ LONG_MAX-1 === pow(LONG_MAX-1,1)
046+ Left: int(9223372036854775806)
047+ Right: int(-9223372036854775808)
048+
049+ Assert failed:
050+ LONG_MIN+1 === pow(LONG_MIN+1,1)
051+ Left: int(-9223372036854775807)
052+ Right: int(-9223372036854775808)
053+
054+ Assert failed:
055+ LONG_MAX === pow(LONG_MAX,1)
056+ Left: int(9223372036854775807)
057+ Right: int(-9223372036854775808)
================================================================================
================================================================================
/house/elmicha/local/src/php-4.3.2RC2/ext/standard/tests/math/round.phpt
================================================================================
---- EXPECTED OUTPUT
1,1,0,0
OK
---- ACTUAL OUTPUT
1,1,1,1
Assert failed:
LONG_MIN-1 ~== round(LONG_MIN - 0.6)
Left: int(9223372036854775807)
Right: float(-9.2233720368548E+18)
Assert failed:
LONG_MIN-1 ~== floor(LONG_MIN - 0.5)
Left: int(9223372036854775807)
Right: float(-9.2233720368548E+18)
Assert failed:
LONG_MAX+1 ~== ceil(LONG_MAX + 0.5)
Left: int(-9223372036854775808)
Right: float(9.2233720368548E+18)
Assert failed:
LONG_MAX+1 ~== round(LONG_MAX + 0.6)
Left: int(-9223372036854775808)
Right: float(9.2233720368548E+18)
---- FAILED
================================================================================
001- 1,1,0,0
001+ 1,1,1,1
002- OK
002+
003+ Assert failed:
004+ LONG_MIN-1 ~== round(LONG_MIN - 0.6)
005+ Left: int(9223372036854775807)
006+ Right: float(-9.2233720368548E+18)
007+
008+ Assert failed:
009+ LONG_MIN-1 ~== floor(LONG_MIN - 0.5)
010+ Left: int(9223372036854775807)
011+ Right: float(-9.2233720368548E+18)
012+
013+ Assert failed:
014+ LONG_MAX+1 ~== ceil(LONG_MAX + 0.5)
015+ Left: int(-9223372036854775808)
016+ Right: float(9.2233720368548E+18)
017+
018+ Assert failed:
019+ LONG_MAX+1 ~== round(LONG_MAX + 0.6)
020+ Left: int(-9223372036854775808)
021+ Right: float(9.2233720368548E+18)
================================================================================
================================================================================
/house/elmicha/local/src/php-4.3.2RC2/ext/standard/tests/time/001.phpt
================================================================================
---- EXPECTED OUTPUT
Passed: 100000
Failed: 0
---- ACTUAL OUTPUT
Passed: 4367
Failed: 95633
000002: 1051644432 0.55704000 < 1051644432 0.55704000
000003: 1051644432 0.55704000 < 1051644432 0.55704000
000004: 1051644432 0.55704000 < 1051644432 0.55704000
000005: 1051644432 0.55704000 < 1051644432 0.55704000
000006: 1051644432 0.55704000 < 1051644432 0.55704000
000007: 1051644432 0.55704000 < 1051644432 0.55704000
000008: 1051644432 0.55704000 < 1051644432 0.55704000
000009: 1051644432 0.55704000 < 1051644432 0.55704000
000010: 1051644432 0.55704000 < 1051644432 0.55704000
000011: 1051644432 0.55704000 < 1051644432 0.55704000
000013: 1051644432 0.55801700 < 1051644432 0.55801700
---- FAILED
================================================================================
001- Passed: 100000
001+ Passed: 4367
002- Failed: 0
002+ Failed: 95633
003+ 000002: 1051644432 0.55704000 < 1051644432 0.55704000
004+ 000003: 1051644432 0.55704000 < 1051644432 0.55704000
005+ 000004: 1051644432 0.55704000 < 1051644432 0.55704000
006+ 000005: 1051644432 0.55704000 < 1051644432 0.55704000
007+ 000006: 1051644432 0.55704000 < 1051644432 0.55704000
008+ 000007: 1051644432 0.55704000 < 1051644432 0.55704000
009+ 000008: 1051644432 0.55704000 < 1051644432 0.55704000
010+ 000009: 1051644432 0.55704000 < 1051644432 0.55704000
011+ 000010: 1051644432 0.55704000 < 1051644432 0.55704000
012+ 000011: 1051644432 0.55704000 < 1051644432 0.55704000
013+ 000013: 1051644432 0.55801700 < 1051644432 0.55801700
================================================================================
================================================================================
/house/elmicha/local/src/php-4.3.2RC2/ext/standard/tests/time/002.phpt
================================================================================
---- EXPECTED OUTPUT
1999-10-13 00:00:00
1999-10-13 00:00:00
2000-01-19 00:00:00
2000-01-19 00:00:00
2001-12-21 00:00:00
2001-12-21 00:00:00
2001-12-21 12:16:00
2001-12-21 12:16:00
1969-12-31 23:59:59
2001-10-22 21:19:58
2001-10-22 23:19:58
2001-10-22 23:32:58
2001-10-22 19:19:58
2001-10-22 19:06:58
1999-10-13 00:00:00
1999-10-13 00:00:00
2000-01-19 00:00:00
2000-01-19 00:00:00
2001-12-21 00:00:00
2001-12-21 00:00:00
2001-12-21 12:16:00
2001-12-21 12:16:00
1969-12-31 18:59:59
2001-10-22 21:19:58
2001-10-22 19:19:58
2001-10-22 19:32:58
2001-10-22 15:19:58
2001-10-22 15:06:58
---- ACTUAL OUTPUT
1999-10-13 00:00:00
1999-10-13 00:00:00
2000-01-19 00:00:00
2000-01-19 00:00:00
2001-12-21 00:00:00
2001-12-21 00:00:00
2001-12-21 12:16:00
2001-12-21 12:16:00
1969-12-31 18:59:59
2001-10-22 21:19:58
2001-10-22 19:19:58
2001-10-22 19:32:58
2001-10-22 15:19:58
2001-10-22 15:06:58
1999-10-13 00:00:00
1999-10-13 00:00:00
2000-01-19 00:00:00
2000-01-19 00:00:00
2001-12-21 00:00:00
2001-12-21 00:00:00
2001-12-21 12:16:00
2001-12-21 12:16:00
1969-12-31 18:59:59
2001-10-22 21:19:58
2001-10-22 19:19:58
2001-10-22 19:32:58
2001-10-22 15:19:58
2001-10-22 15:06:58
---- FAILED
================================================================================
009- 1969-12-31 23:59:59
009+ 1969-12-31 18:59:59
011- 2001-10-22 23:19:58
011+ 2001-10-22 19:19:58
012- 2001-10-22 23:32:58
012+ 2001-10-22 19:32:58
013- 2001-10-22 19:19:58
013+ 2001-10-22 15:19:58
014- 2001-10-22 19:06:58
014+ 2001-10-22 15:06:58
================================================================================
================================================================================
/house/elmicha/local/src/php-4.3.2RC2/ext/standard/tests/time/mktime.phpt
================================================================================
---- EXPECTED OUTPUT
int(1009843200)
int(1009843200)
int(1009843200)
int(1009843200)
int(1025481600)
int(1025481600)
int(1025481600)
int(1025481600)
int(1009839600)
int(1009839600)
int(1009839600)
int(1009836000)
int(1025474400)
int(1025474400)
int(1025478000)
int(1025474400)
---- ACTUAL OUTPUT
int(1009861200)
int(1009861200)
int(1009861200)
int(1009857600)
int(1025496000)
int(1025496000)
int(1025499600)
int(1025496000)
int(1009839600)
int(1009839600)
int(1009839600)
int(1009836000)
int(1025474400)
int(1025474400)
int(1025478000)
int(1025474400)
---- FAILED
================================================================================
001- int(1009843200)
001+ int(1009861200)
002- int(1009843200)
002+ int(1009861200)
003- int(1009843200)
003+ int(1009861200)
004- int(1009843200)
004+ int(1009857600)
005- int(1025481600)
005+ int(1025496000)
006- int(1025481600)
006+ int(1025496000)
007- int(1025481600)
007+ int(1025499600)
008- int(1025481600)
008+ int(1025496000)
================================================================================
================================================================================
BUILD ENVIRONMENT
================================================================================
OS:
OSF1
Automake:
Autoconf:
Libtool:
ltmain.sh (GNU libtool) 1.4.3 (1.922.2.110 2002/10/23 01:39:54)
Compiler:
Compaq C V6.3-025 on Compaq Tru64 UNIX V5.1 (Rev. 732)
Compiler Driver V6.3-026 (sys) cc Driver
Bison:
Libraries:
Main => /house/elmicha/local/src/php-4.3.2RC2/sapi/cli/php
libm.so => /usr/shlib/libm.so
libexc.so => /usr/shlib/libexc.so
librt.so => /usr/shlib/librt.so
libaio_raw.so => /usr/shlib/libaio_raw.so
libclntsh.so.8.0 => /usr/app/oracle/product/8.1.7/lib/libclntsh.so.8.0
libocijdbc8.so => /usr/app/oracle/product/8.1.7/lib/libocijdbc8.so
libc.so => /usr/shlib/libc.so
libwtc8.so => /usr/app/oracle/product/8.1.7/lib/libwtc8.so
libpthread.so => /usr/shlib/libpthread.so
================================================================================
PHPINFO
================================================================================
phpinfo()
PHP Version => 4.3.2-RC2
System => OSF1 spe155 V5.1 732 alpha
Build Date => Apr 29 2003 14:48:36
Configure Command => './configure' '--with-oci8'
'--prefix=/house/elmicha/spe155'
Server API => Command Line Interface
Virtual Directory Support => disabled
Configuration File (php.ini) Path => /house/elmicha/spe155/lib
PHP API => 20020918
PHP Extension => 20020429
Zend Extension => 20021010
Debug Build => no
Thread Safety => disabled
Registered PHP Streams => php, http, ftp
This program makes use of the Zend Scripting Language Engine:
Zend Engine v1.3.0, Copyright (c) 1998-2003 Zend Technologies
_______________________________________________________________________
Configuration
PHP Core
Directive => Local Value => Master Value
allow_call_time_pass_reference => On => On
allow_url_fopen => On => On
always_populate_raw_post_data => Off => Off
arg_separator.input => & => &
arg_separator.output => & => &
asp_tags => Off => Off
auto_append_file => no value => no value
auto_prepend_file => no value => no value
browscap => no value => no value
default_charset => no value => no value
default_mimetype => text/html => text/html
define_syslog_variables => Off => Off
disable_classes => no value => no value
disable_functions => no value => no value
display_errors => On => On
display_startup_errors => Off => Off
doc_root => no value => no value
docref_ext => no value => no value
docref_root => no value => no value
enable_dl => On => On
error_append_string => no value => no value
error_log => no value => no value
error_prepend_string => no value => no value
error_reporting => no value => no value
expose_php => On => On
extension_dir => /house/elmicha/spe155/lib/php/extensions/no-debug-non-zts-20020429 =>
/house/elmicha/spe155/lib/php/extensions/no-debug-non-zts-20020429
file_uploads => On => On
gpc_order => GPC => GPC
highlight.bg => #FFFFFF => #FFFFFF
highlight.comment => #FF8000 => #FF8000
highlight.default => #0000BB => #0000BB
highlight.html => #000000 => #000000
highlight.keyword => #007700 => #007700
highlight.string => #DD0000 => #DD0000
html_errors => Off => On
ignore_repeated_errors => Off => Off
ignore_repeated_source => Off => Off
ignore_user_abort => Off => Off
implicit_flush => On => Off
include_path => .:/house/elmicha/spe155/lib/php => .:/house/elmicha/spe155/lib/php
log_errors => Off => Off
log_errors_max_len => 1024 => 1024
magic_quotes_gpc => On => On
magic_quotes_runtime => Off => Off
magic_quotes_sybase => Off => Off
max_execution_time => 0 => 30
max_input_time => -1 => -1
open_basedir => no value => no value
output_buffering => 0 => 0
output_handler => no value => no value
post_max_size => 8M => 8M
precision => 14 => 14
register_argc_argv => On => On
register_globals => Off => Off
report_memleaks => On => On
safe_mode => Off => Off
safe_mode_exec_dir => /usr/local/php/bin => /usr/local/php/bin
safe_mode_gid => Off => Off
safe_mode_include_dir => no value => no value
sendmail_from => no value => no value
sendmail_path => /usr/sbin/sendmail -t -i => /usr/sbin/sendmail -t -i
short_open_tag => On => On
SMTP => localhost => localhost
smtp_port => 25 => 25
sql.safe_mode => Off => Off
track_errors => Off => Off
unserialize_callback_func => no value => no value
upload_max_filesize => 2M => 2M
upload_tmp_dir => no value => no value
user_dir => no value => no value
variables_order => no value => no value
xmlrpc_error_number => 0 => 0
xmlrpc_errors => Off => Off
y2k_compliance => On => On
ctype
ctype functions => enabled
mysql
MySQL Support => enabled
Active Persistent Links => 0
Active Links => 0
Client API version => 3.23.49
MYSQL_MODULE_TYPE => builtin
MYSQL_SOCKET => /tmp/mysql.sock
MYSQL_INCLUDE =>
MYSQL_LIBS =>
Directive => Local Value => Master Value
mysql.allow_persistent => On => On
mysql.connect_timeout => -1 => -1
mysql.default_host => no value => no value
mysql.default_password => no value => no value
mysql.default_port => no value => no value
mysql.default_socket => no value => no value
mysql.default_user => no value => no value
mysql.max_links => Unlimited => Unlimited
mysql.max_persistent => Unlimited => Unlimited
mysql.trace_mode => Off => Off
oci8
OCI8 Support => enabled
Revision => $Revision: 1.183.2.3 $
Oracle Version => 8.1
Compile-time ORACLE_HOME => /usr/app/oracle/product/8.1.7
Libraries Used =>
overload
User-Space Object Overloading Support => enabled
pcre
PCRE (Perl Compatible Regular Expressions) Support => enabled
PCRE Library Version => 3.92 11-Sep-2002
posix
Revision => $Revision: 1.51.2.2 $
session
Session Support => enabled
Registered save handlers => files user
Directive => Local Value => Master Value
session.auto_start => Off => Off
session.bug_compat_42 => On => On
session.bug_compat_warn => On => On
session.cache_expire => 180 => 180
session.cache_limiter => nocache => nocache
session.cookie_domain => no value => no value
session.cookie_lifetime => 0 => 0
session.cookie_path => / => /
session.cookie_secure => Off => Off
session.entropy_file => no value => no value
session.entropy_length => 0 => 0
session.gc_divisor => 100 => 100
session.gc_maxlifetime => 1440 => 1440
session.gc_probability => 1 => 1
session.name => PHPSESSID => PHPSESSID
session.referer_check => no value => no value
session.save_handler => files => files
session.save_path => /tmp => /tmp
session.serialize_handler => php => php
session.use_cookies => On => On
session.use_only_cookies => Off => Off
session.use_trans_sid => Off => Off
standard
Regex Library => Bundled library enabled
Dynamic Library Support => enabled
Path to sendmail => /usr/sbin/sendmail -t -i
Directive => Local Value => Master Value
assert.active => 1 => 1
assert.bail => 0 => 0
assert.callback => no value => no value
assert.quiet_eval => 0 => 0
assert.warning => 1 => 1
auto_detect_line_endings => 0 => 0
default_socket_timeout => 60 => 60
safe_mode_allowed_env_vars => PHP_ => PHP_
safe_mode_protected_env_vars => LD_LIBRARY_PATH => LD_LIBRARY_PATH
url_rewriter.tags => a=href,area=href,frame=src,form=,fieldset= =>
a=href,area=href,frame=src,form=,fieldset=
user_agent => no value => no value
tokenizer
Tokenizer Support => enabled
xml
XML Support => active
XML Namespace Support => active
EXPAT Version => 1.95.2
Additional Modules
Module Name
Environment
Variable => Value
PAGER => more
QUERY_STRING =>
PATH =>
/house/elmicha/spe155/bin:/usr/local/bin:/usr/bin/posix:/usr/bin:.:/usr/app/oracle/product/8.1.7/bin:/usr/local/bin
OLDPWD => /house/elmicha/local/src
SCRIPT_FILENAME =>
CONTENT_TYPE =>
EDITOR => emacs
LOGNAME => elmicha
REDIRECT_STATUS =>
HOSTNAME => spe155
ORACLE_SID => ORAPORT
PRINTER => lp
GWSOURCE => telnet
REQUEST_METHOD =>
USER => elmicha
PATH_TRANSLATED =>
SHLVL => 2
CC => cc
CONTENT_LENGTH =>
TEST_PHP_EXECUTABLE => /house/elmicha/local/src/php-4.3.2RC2/sapi/cli/php
SHELL => /bin/ksh
HOSTTYPE => alphaev6
OSTYPE => osf5.1
HOME => /house/elmicha
TEST_PHP_SRCDIR => /house/elmicha/local/src/php-4.3.2RC2
LD_LIBRARY_PATH =>
/usr/app/oracle/product/8.1.7/lib:/usr/app/oracle/product/8.1.7/obackup/lib:/house/elmicha/spe155/lib
TERM => xterm
ORACLE_HOME => /usr/app/oracle/product/8.1.7
PWD => /house/elmicha/local/src/php-4.3.2RC2
MACHTYPE => alphaev6-dec-osf5.1
PHP Variables
Variable => Value
_SERVER["PAGER"] => more
_SERVER["QUERY_STRING"] =>
_SERVER["PATH"] =>
/house/elmicha/spe155/bin:/usr/local/bin:/usr/bin/posix:/usr/bin:.:/usr/app/oracle/product/8.1.7/bin:/usr/local/bin
_SERVER["OLDPWD"] => /house/elmicha/local/src
_SERVER["SCRIPT_FILENAME"] =>
_SERVER["CONTENT_TYPE"] =>
_SERVER["EDITOR"] => emacs
_SERVER["LOGNAME"] => elmicha
_SERVER["REDIRECT_STATUS"] =>
_SERVER["HOSTNAME"] => spe155
_SERVER["ORACLE_SID"] => ORAPORT
_SERVER["PRINTER"] => lp
_SERVER["GWSOURCE"] => telnet
_SERVER["REQUEST_METHOD"] =>
_SERVER["USER"] => elmicha
_SERVER["PATH_TRANSLATED"] =>
_SERVER["SHLVL"] => 2
_SERVER["CC"] => cc
_SERVER["CONTENT_LENGTH"] =>
_SERVER["TEST_PHP_EXECUTABLE"] => /house/elmicha/local/src/php-4.3.2RC2/sapi/cli/php
_SERVER["SHELL"] => /bin/ksh
_SERVER["HOSTTYPE"] => alphaev6
_SERVER["OSTYPE"] => osf5.1
_SERVER["HOME"] => /house/elmicha
_SERVER["TEST_PHP_SRCDIR"] => /house/elmicha/local/src/php-4.3.2RC2
_SERVER["LD_LIBRARY_PATH"] =>
/usr/app/oracle/product/8.1.7/lib:/usr/app/oracle/product/8.1.7/obackup/lib:/house/elmicha/spe155/lib
_SERVER["TERM"] => xterm
_SERVER["ORACLE_HOME"] => /usr/app/oracle/product/8.1.7
_SERVER["PWD"] => /house/elmicha/local/src/php-4.3.2RC2
_SERVER["MACHTYPE"] => alphaev6-dec-osf5.1
_SERVER["PHP_SELF"] =>
_SERVER["SCRIPT_NAME"] =>
_SERVER["DOCUMENT_ROOT"] =>
_SERVER["argv"] => Array
(
)
_SERVER["argc"] => 0
_ENV["PAGER"] => more
_ENV["QUERY_STRING"] =>
_ENV["PATH"] =>
/house/elmicha/spe155/bin:/usr/local/bin:/usr/bin/posix:/usr/bin:.:/usr/app/oracle/product/8.1.7/bin:/usr/local/bin
_ENV["OLDPWD"] => /house/elmicha/local/src
_ENV["SCRIPT_FILENAME"] =>
_ENV["CONTENT_TYPE"] =>
_ENV["EDITOR"] => emacs
_ENV["LOGNAME"] => elmicha
_ENV["REDIRECT_STATUS"] =>
_ENV["HOSTNAME"] => spe155
_ENV["ORACLE_SID"] => ORAPORT
_ENV["PRINTER"] => lp
_ENV["GWSOURCE"] => telnet
_ENV["REQUEST_METHOD"] =>
_ENV["USER"] => elmicha
_ENV["PATH_TRANSLATED"] =>
_ENV["SHLVL"] => 2
_ENV["CC"] => cc
_ENV["CONTENT_LENGTH"] =>
_ENV["TEST_PHP_EXECUTABLE"] => /house/elmicha/local/src/php-4.3.2RC2/sapi/cli/php
_ENV["SHELL"] => /bin/ksh
_ENV["HOSTTYPE"] => alphaev6
_ENV["OSTYPE"] => osf5.1
_ENV["HOME"] => /house/elmicha
_ENV["TEST_PHP_SRCDIR"] => /house/elmicha/local/src/php-4.3.2RC2
_ENV["LD_LIBRARY_PATH"] =>
/usr/app/oracle/product/8.1.7/lib:/usr/app/oracle/product/8.1.7/obackup/lib:/house/elmicha/spe155/lib
_ENV["TERM"] => xterm
_ENV["ORACLE_HOME"] => /usr/app/oracle/product/8.1.7
_ENV["PWD"] => /house/elmicha/local/src/php-4.3.2RC2
_ENV["MACHTYPE"] => alphaev6-dec-osf5.1
PHP License
This program is free software; you can redistribute it and/or modify
it under the terms of the PHP License as published by the PHP Group
and included in the distribution in the file: LICENSE
This program is distributed in the hope that it will be useful,
but WITHOUT ANY WARRANTY; without even the implied warranty of
MERCHANTABILITY or FITNESS FOR A PARTICULAR PURPOSE.
If you did not receive a copy of the PHP license, or have any
questions about PHP licensing, please contact license@php.net.