Test results for 4.3.2RC4 [failed]

From: Date: Thu, 22 May 2003 20:33:53 +0000
Subject: Test results for 4.3.2RC4 [failed]
Groups: php.qa 
Request: Send a blank email to php-qa+get-12912@lists.php.net to get a copy of this message
===================================================================== FAILED TEST SUMMARY --------------------------------------------------------------------- session object deserialization [ext/session/tests/003.phpt] session_set_save_handler test [ext/session/tests/004.phpt] custom save handler, multiple session_start()s, complex data structure test. [ext/session/tests/005.phpt] bug compatibility: global is used albeit register_globals=0 [ext/session/tests/008-php4.2.3.phpt] unset($_SESSION["name"]); should work with register_globals=off [ext/session/tests/009.phpt] redefining SID should not cause warnings [ext/session/tests/013.phpt] a script should not be able to modify session.use_trans_sid [ext/session/tests/014.phpt] use_trans_sid should not affect SID [ext/session/tests/015.phpt] rewriter correctly handles attribute names which contain dashes [ext/session/tests/018.phpt] rewriter uses arg_seperator.output for modifying URLs [ext/session/tests/020.phpt] rewriter handles form and fieldset tags correctly [ext/session/tests/021.phpt] ===================================================================== ===================================================================== TEST RESULT SUMMARY --------------------------------------------------------------------- Exts skipped : 75 Exts tested : 12 --------------------------------------------------------------------- Number of tests : 476 Tests skipped : 223 (46.8%) Tests failed : 11 ( 2.3%) Tests passed : 242 (50.8%) --------------------------------------------------------------------- Time taken : 13 seconds ===================================================================== ================================================================================ /var/ftp/pub/linux_stuff/addons/php/php-4.3.2RC4/ext/session/tests/003.phpt ================================================================================ ---- EXPECTED OUTPUT object(foo)(2) { ["bar"]=> string(2) "ok" ["yes"]=> int(2) } array(1) { [3]=> &object(foo)(2) { ["bar"]=> string(2) "ok" ["yes"]=> int(2) } } ---- ACTUAL OUTPUT object(foo)(2) { ["bar"]=> string(2) "ok" ["yes"]=> int(2) } array(1) { [3]=> &object(foo)(2) { ["bar"]=> string(2) "ok" ["yes"]=> int(2) } } Warning: session_destroy(): Session object destruction failed in /var/ftp/pub/linux_stuff/addons/php/php-4.3.2RC4/ext/session/tests/003.php on line 18 ---- FAILED ================================================================================ 016+ 017+ Warning: session_destroy(): Session object destruction failed in /var/ftp/pub/linux_stuff/addons/php/php-4.3.2RC4/ext/session/tests/003.php on line 18 ================================================================================ ================================================================================ /var/ftp/pub/linux_stuff/addons/php/php-4.3.2RC4/ext/session/tests/004.phpt ================================================================================ ---- EXPECTED OUTPUT OPEN: PHPSESSID READ: abtest object(foo)(2) { ["bar"]=> string(2) "ok" ["yes"]=> int(2) } array(1) { [3]=> &object(foo)(2) { ["bar"]=> string(2) "ok" ["yes"]=> int(2) } } WRITE: abtest, baz|O:3:"foo":2:{s:3:"bar";s:2:"ok";s:3:"yes";i:2;}arr|a:1:{i:3;O:3:"foo":2:{s:3:"bar";s:2:"ok";s:3:"yes";i:2;}} OPEN: PHPSESSID READ: abtest object(foo)(2) { ["bar"]=> string(2) "ok" ["yes"]=> int(2) } array(1) { [3]=> object(foo)(2) { ["bar"]=> string(2) "ok" ["yes"]=> int(2) } } DESTROY: abtest ---- ACTUAL OUTPUT Fatal error: Call to a member function on a non-object in /var/ftp/pub/linux_stuff/addons/php/php-4.3.2RC4/ext/session/tests/004.php on line 48 ---- FAILED ================================================================================ 001- OPEN: PHPSESSID 001+ Fatal error: Call to a member function on a non-object in /var/ftp/pub/linux_stuff/addons/php/php-4.3.2RC4/ext/session/tests/004.php on line 48 002- READ: abtest 003- object(foo)(2) { 004- ["bar"]=> 005- string(2) "ok" 006- ["yes"]=> 007- int(2) 008- } 009- array(1) { 010- [3]=> 011- &object(foo)(2) { 012- ["bar"]=> 013- string(2) "ok" 014- ["yes"]=> 015- int(2) 016- } 017- } 018- WRITE: abtest, baz|O:3:"foo":2:{s:3:"bar";s:2:"ok";s:3:"yes";i:2;}arr|a:1:{i:3;O:3:"foo":2:{s:3:"bar";s:2:"ok";s:3:"yes";i:2;}} 019- OPEN: PHPSESSID 020- READ: abtest 021- object(foo)(2) { 022- ["bar"]=> 023- string(2) "ok" 024- ["yes"]=> 025- int(2) 026- } 027- array(1) { 028- [3]=> 029- object(foo)(2) { 030- ["bar"]=> 031- string(2) "ok" 032- ["yes"]=> 033- int(2) 034- } 035- } 036- DESTROY: abtest ================================================================================ ================================================================================ /var/ftp/pub/linux_stuff/addons/php/php-4.3.2RC4/ext/session/tests/005.phpt ================================================================================ ---- EXPECTED OUTPUT OPEN: PHPSESSID READ: abtest object(foo)(2) { ["bar"]=> string(2) "ok" ["yes"]=> int(2) } array(1) { [3]=> &object(foo)(2) { ["bar"]=> string(2) "ok" ["yes"]=> int(2) } } WRITE: abtest, baz|O:3:"foo":2:{s:3:"bar";s:2:"ok";s:3:"yes";i:2;}arr|a:1:{i:3;O:3:"foo":2:{s:3:"bar";s:2:"ok";s:3:"yes";i:2;}} CLOSE OPEN: PHPSESSID READ: abtest object(foo)(2) { ["bar"]=> string(2) "ok" ["yes"]=> int(3) } array(1) { [3]=> &object(foo)(2) { ["bar"]=> string(2) "ok" ["yes"]=> int(3) } } int(123) WRITE: abtest, baz|O:3:"foo":2:{s:3:"bar";s:2:"ok";s:3:"yes";i:3;}arr|a:1:{i:3;O:3:"foo":2:{s:3:"bar";s:2:"ok";s:3:"yes";i:3;}}c|i:123; CLOSE OPEN: PHPSESSID READ: abtest object(foo)(2) { ["bar"]=> string(2) "ok" ["yes"]=> int(3) } array(1) { [3]=> object(foo)(2) { ["bar"]=> string(2) "ok" ["yes"]=> int(3) } } int(123) DESTROY: abtest CLOSE ---- ACTUAL OUTPUT Fatal error: Call to a member function on a non-object in /var/ftp/pub/linux_stuff/addons/php/php-4.3.2RC4/ext/session/tests/005.php on line 50 ---- FAILED ================================================================================ 001- OPEN: PHPSESSID 001+ Fatal error: Call to a member function on a non-object in /var/ftp/pub/linux_stuff/addons/php/php-4.3.2RC4/ext/session/tests/005.php on line 50 002- READ: abtest 003- object(foo)(2) { 004- ["bar"]=> 005- string(2) "ok" 006- ["yes"]=> 007- int(2) 008- } 009- array(1) { 010- [3]=> 011- &object(foo)(2) { 012- ["bar"]=> 013- string(2) "ok" 014- ["yes"]=> 015- int(2) 016- } 017- } 018- WRITE: abtest, baz|O:3:"foo":2:{s:3:"bar";s:2:"ok";s:3:"yes";i:2;}arr|a:1:{i:3;O:3:"foo":2:{s:3:"bar";s:2:"ok";s:3:"yes";i:2;}} 019- CLOSE 020- OPEN: PHPSESSID 021- READ: abtest 022- object(foo)(2) { 023- ["bar"]=> 024- string(2) "ok" 025- ["yes"]=> 026- int(3) 027- } 028- array(1) { 029- [3]=> 030- &object(foo)(2) { 031- ["bar"]=> 032- string(2) "ok" 033- ["yes"]=> 034- int(3) 035- } 036- } 037- int(123) 038- WRITE: abtest, baz|O:3:"foo":2:{s:3:"bar";s:2:"ok";s:3:"yes";i:3;}arr|a:1:{i:3;O:3:"foo":2:{s:3:"bar";s:2:"ok";s:3:"yes";i:3;}}c|i:123; 039- CLOSE 040- OPEN: PHPSESSID 041- READ: abtest 042- object(foo)(2) { 043- ["bar"]=> 044- string(2) "ok" 045- ["yes"]=> 046- int(3) 047- } 048- array(1) { 049- [3]=> 050- object(foo)(2) { 051- ["bar"]=> 052- string(2) "ok" 053- ["yes"]=> 054- int(3) 055- } 056- } 057- int(123) 058- DESTROY: abtest 059- CLOSE ================================================================================ ================================================================================ /var/ftp/pub/linux_stuff/addons/php/php-4.3.2RC4/ext/session/tests/008-php4.2.3.phpt ================================================================================ ---- EXPECTED OUTPUT NULL Your script possibly relies on a session side-effect which existed until PHP 4.2.3. Please be advised that the session extension does not consider global variables as a source of data, unless register_globals is enabled. You can disable this functionality and this warning by setting session.bug_compat_42 or session.bug_compat_warn to off, respectively. array(1) { ["c"]=> float(3.14) } NULL array(1) { ["c"]=> float(3.14) } ---- ACTUAL OUTPUT Warning: session_destroy(): Session object destruction failed in /var/ftp/pub/linux_stuff/addons/php/php-4.3.2RC4/ext/session/tests/008-php4.2.3.php on line 6 NULL Your script possibly relies on a session side-effect which existed until PHP 4.2.3. Please be advised that the session extension does not consider global variables as a source of data, unless register_globals is enabled. You can disable this functionality and this warning by setting session.bug_compat_42 or session.bug_compat_warn to off, respectively. array(1) { ["c"]=> float(3.14) } NULL array(1) { ["c"]=> float(3.14) } ---- FAILED ================================================================================ 001- NULL 001+ Warning: session_destroy(): Session object destruction failed in /var/ftp/pub/linux_stuff/addons/php/php-4.3.2RC4/ext/session/tests/008-php4.2.3.php on line 6 002- Your script possibly relies on a session side-effect which existed until PHP 4.2.3. Please be advised that the session extension does not consider global variables as a source of data, unless register_globals is enabled. You can disable this functionality and this warning by setting session.bug_compat_42 or session.bug_compat_warn to off, respectively. 002+ NULL 003- array(1) { 003+ Your script possibly relies on a session side-effect which existed until PHP 4.2.3. Please be advised that the session extension does not consider global variables as a source of data, unless register_globals is enabled. You can disable this functionality and this warning by setting session.bug_compat_42 or session.bug_compat_warn to off, respectively. 004- ["c"]=> 004+ array(1) { 005- float(3.14) 005+ ["c"]=> 006- } 006+ float(3.14) 007- NULL 007+ } 008- array(1) { 008+ NULL 009- ["c"]=> 009+ array(1) { 010- float(3.14) 010+ ["c"]=> 011- } 011+ float(3.14) 012+ } ================================================================================ ================================================================================ /var/ftp/pub/linux_stuff/addons/php/php-4.3.2RC4/ext/session/tests/009.phpt ================================================================================ ---- EXPECTED OUTPUT array(0) { } array(1) { ["name"]=> string(3) "foo" } array(1) { ["name"]=> string(3) "foo" } array(0) { } array(0) { } ---- ACTUAL OUTPUT Warning: session_destroy(): Session object destruction failed in /var/ftp/pub/linux_stuff/addons/php/php-4.3.2RC4/ext/session/tests/009.php on line 8 array(0) { } array(1) { ["name"]=> string(3) "foo" } array(1) { ["name"]=> string(3) "foo" } array(0) { } array(0) { } ---- FAILED ================================================================================ 001- array(0) { 001+ Warning: session_destroy(): Session object destruction failed in /var/ftp/pub/linux_stuff/addons/php/php-4.3.2RC4/ext/session/tests/009.php on line 8 002- } 002+ array(0) { 003- array(1) { 003+ } 004- ["name"]=> 004+ array(1) { 005- string(3) "foo" 005+ ["name"]=> 006- } 006+ string(3) "foo" 007- array(1) { 007+ } 008- ["name"]=> 008+ array(1) { 009- string(3) "foo" 009+ ["name"]=> 010- } 010+ string(3) "foo" 011- array(0) { 011+ } 012- } 012+ array(0) { 013- array(0) { 013+ } 014- } 014+ array(0) { 015+ } ================================================================================ ================================================================================ /var/ftp/pub/linux_stuff/addons/php/php-4.3.2RC4/ext/session/tests/013.phpt ================================================================================ ---- EXPECTED OUTPUT I live ---- ACTUAL OUTPUT Warning: session_destroy(): Session object destruction failed in /var/ftp/pub/linux_stuff/addons/php/php-4.3.2RC4/ext/session/tests/013.php on line 6 I live ---- FAILED ================================================================================ 001- I live 001+ Warning: session_destroy(): Session object destruction failed in /var/ftp/pub/linux_stuff/addons/php/php-4.3.2RC4/ext/session/tests/013.php on line 6 002+ I live ================================================================================ ================================================================================ /var/ftp/pub/linux_stuff/addons/php/php-4.3.2RC4/ext/session/tests/014.phpt ================================================================================ ---- EXPECTED OUTPUT <a href="/link?PHPSESSID=abtest"> <a href="/link?PHPSESSID=abtest"> <a href="/link?PHPSESSID=abtest"> ---- ACTUAL OUTPUT <a href="/link?PHPSESSID=7d96105c00af5a59424740c6f92797d7"> <a href="/link?PHPSESSID=7d96105c00af5a59424740c6f92797d7"> <a href="/link?PHPSESSID=7d96105c00af5a59424740c6f92797d7"> Warning: session_destroy(): Session object destruction failed in /var/ftp/pub/linux_stuff/addons/php/php-4.3.2RC4/ext/session/tests/014.php on line 18 ---- FAILED ================================================================================ 001- <a href="/link?PHPSESSID=abtest"> 001+ <a href="/link?PHPSESSID=7d96105c00af5a59424740c6f92797d7"> 002- <a href="/link?PHPSESSID=abtest"> 002+ <a href="/link?PHPSESSID=7d96105c00af5a59424740c6f92797d7"> 003- <a href="/link?PHPSESSID=abtest"> 003+ <a href="/link?PHPSESSID=7d96105c00af5a59424740c6f92797d7"> 004+ 005+ Warning: session_destroy(): Session object destruction failed in /var/ftp/pub/linux_stuff/addons/php/php-4.3.2RC4/ext/session/tests/014.php on line 18 ================================================================================ ================================================================================ /var/ftp/pub/linux_stuff/addons/php/php-4.3.2RC4/ext/session/tests/015.phpt ================================================================================ ---- EXPECTED OUTPUT <a href="/link?PHPSESSID=abtest&PHPSESSID=abtest"> ---- ACTUAL OUTPUT <a href="/link?PHPSESSID=c2c887b59f88ff7aa9b9dbdc5cee16aa&PHPSESSID=c2c887b59f88ff7aa9b9dbdc5cee16aa"> Warning: session_destroy(): Session object destruction failed in /var/ftp/pub/linux_stuff/addons/php/php-4.3.2RC4/ext/session/tests/015.php on line 9 ---- FAILED ================================================================================ 001- <a href="/link?PHPSESSID=abtest&PHPSESSID=abtest"> 001+ <a href="/link?PHPSESSID=c2c887b59f88ff7aa9b9dbdc5cee16aa&PHPSESSID=c2c887b59f88ff7aa9b9dbdc5cee16aa"> 002+ 003+ Warning: session_destroy(): Session object destruction failed in /var/ftp/pub/linux_stuff/addons/php/php-4.3.2RC4/ext/session/tests/015.php on line 9 ================================================================================ ================================================================================ /var/ftp/pub/linux_stuff/addons/php/php-4.3.2RC4/ext/session/tests/018.phpt ================================================================================ ---- EXPECTED OUTPUT <form accept-charset="ISO-8859-15, ISO-8859-1" action=url.php><input type="hidden" name="PHPSESSID" value="abtest" /> ---- ACTUAL OUTPUT <form accept-charset="ISO-8859-15, ISO-8859-1" action=url.php><input type="hidden" name="PHPSESSID" value="cdb7d0dd2d74615ae5bbbc2798aba380" /> Warning: session_destroy(): Session object destruction failed in /var/ftp/pub/linux_stuff/addons/php/php-4.3.2RC4/ext/session/tests/018.php on line 10 ---- FAILED ================================================================================ 001- <form accept-charset="ISO-8859-15, ISO-8859-1" action=url.php><input type="hidden" name="PHPSESSID" value="abtest" /> 001+ <form accept-charset="ISO-8859-15, ISO-8859-1" action=url.php><input type="hidden" name="PHPSESSID" value="cdb7d0dd2d74615ae5bbbc2798aba380" /> 002+ 003+ Warning: session_destroy(): Session object destruction failed in /var/ftp/pub/linux_stuff/addons/php/php-4.3.2RC4/ext/session/tests/018.php on line 10 ================================================================================ ================================================================================ /var/ftp/pub/linux_stuff/addons/php/php-4.3.2RC4/ext/session/tests/020.phpt ================================================================================ ---- EXPECTED OUTPUT <a href="link.php?a=b&amp;PHPSESSID=abtest"> ---- ACTUAL OUTPUT <a href="link.php?a=b&amp;PHPSESSID=3d700dc05059f28df9346d11e1f3d6a5"> Warning: session_destroy(): Session object destruction failed in /var/ftp/pub/linux_stuff/addons/php/php-4.3.2RC4/ext/session/tests/020.php on line 10 ---- FAILED ================================================================================ 001- <a href="link.php?a=b&amp;PHPSESSID=abtest"> 001+ <a href="link.php?a=b&amp;PHPSESSID=3d700dc05059f28df9346d11e1f3d6a5"> 002+ 003+ Warning: session_destroy(): Session object destruction failed in /var/ftp/pub/linux_stuff/addons/php/php-4.3.2RC4/ext/session/tests/020.php on line 10 ================================================================================ ================================================================================ /var/ftp/pub/linux_stuff/addons/php/php-4.3.2RC4/ext/session/tests/021.phpt ================================================================================ ---- EXPECTED OUTPUT <form><input type="hidden" name="PHPSESSID" value="abtest" /> <fieldset><input type="hidden" name="PHPSESSID" value="abtest" /> <form><input type="hidden" name="PHPSESSID" value="abtest" /> <fieldset> <form><input type="hidden" name="PHPSESSID" value="abtest" /> <fieldset> <form> <fieldset><input type="hidden" name="PHPSESSID" value="abtest" /> ---- ACTUAL OUTPUT <form><input type="hidden" name="PHPSESSID" value="a4d7d1259565127cdb509261e20b2178" /> <fieldset><input type="hidden" name="PHPSESSID" value="a4d7d1259565127cdb509261e20b2178" /> <form><input type="hidden" name="PHPSESSID" value="a4d7d1259565127cdb509261e20b2178" /> <fieldset> <form><input type="hidden" name="PHPSESSID" value="a4d7d1259565127cdb509261e20b2178" /> <fieldset> <form> <fieldset><input type="hidden" name="PHPSESSID" value="a4d7d1259565127cdb509261e20b2178" /> Warning: session_destroy(): Session object destruction failed in /var/ftp/pub/linux_stuff/addons/php/php-4.3.2RC4/ext/session/tests/021.php on line 39 ---- FAILED ================================================================================ 001- <form><input type="hidden" name="PHPSESSID" value="abtest" /> 001+ <form><input type="hidden" name="PHPSESSID" value="a4d7d1259565127cdb509261e20b2178" /> 002- <fieldset><input type="hidden" name="PHPSESSID" value="abtest" /> 002+ <fieldset><input type="hidden" name="PHPSESSID" value="a4d7d1259565127cdb509261e20b2178" /> 003- <form><input type="hidden" name="PHPSESSID" value="abtest" /> 003+ <form><input type="hidden" name="PHPSESSID" value="a4d7d1259565127cdb509261e20b2178" /> 005- <form><input type="hidden" name="PHPSESSID" value="abtest" /> 005+ <form><input type="hidden" name="PHPSESSID" value="a4d7d1259565127cdb509261e20b2178" /> 008- <fieldset><input type="hidden" name="PHPSESSID" value="abtest" /> 008+ <fieldset><input type="hidden" name="PHPSESSID" value="a4d7d1259565127cdb509261e20b2178" /> 009+ 010+ Warning: session_destroy(): Session object destruction failed in /var/ftp/pub/linux_stuff/addons/php/php-4.3.2RC4/ext/session/tests/021.php on line 39 ================================================================================ ================================================================================ BUILD ENVIRONMENT ================================================================================ OS: Linux Automake: automake (GNU automake) 1.4-p5 Copyright (C) 1999, 2001 Free Software Foundation, Inc. This is free software; see the source for copying conditions. There is NO warranty; not even for MERCHANTABILITY or FITNESS FOR A PARTICULAR PURPOSE. Written by Tom Tromey <tromey@cygnus.com> Autoconf: Autoconf version 2.13 Libtool: ltmain.sh (GNU libtool) 1.4.3 (1.922.2.110 2002/10/23 01:39:54) Compiler: Reading specs from /usr/lib/gcc-lib/i386-redhat-linux/2.96/specs gcc version 2.96 20000731 (Red Hat Linux 7.3 2.96-113) Bison: bison (GNU Bison) 1.35 Copyright 1984, 1986, 1989, 1992, 2000, 2001, 2002 Free Software Foundation, Inc. This is free software; see the source for copying conditions. There is NO warranty; not even for MERCHANTABILITY or FITNESS FOR A PARTICULAR PURPOSE. Libraries: libcrypt.so.1 => /lib/libcrypt.so.1 (0x4001a000) libpng.so.2 => /usr/lib/libpng.so.2 (0x40048000) libz.so.1 => /usr/lib/libz.so.1 (0x4006a000) libresolv.so.2 => /lib/libresolv.so.2 (0x40078000) libm.so.6 => /lib/i686/libm.so.6 (0x40089000) libdl.so.2 => /lib/libdl.so.2 (0x400ab000) libnsl.so.1 => /lib/libnsl.so.1 (0x400ae000) libc.so.6 => /lib/i686/libc.so.6 (0x42000000) /lib/ld-linux.so.2 => /lib/ld-linux.so.2 (0x40000000) User's E-mail: php-general at pennysaverusa dot net ================================================================================ PHPINFO ================================================================================ phpinfo() PHP Version => 4.3.2RC4 System => Linux www2.pennysaverusa.com 2.4.18-27.7.xsmp #1 SMP Fri Mar 14 05:52:30 EST 2003 i686 Build Date => May 21 2003 18:12:35 Configure Command => './configure' '--with-mysql' '--with-gd' '--with-zlib-dir=/usr/lib' '--with-apxs=/usr/sbin/apxs' '--with-config-file-path=/etc' '--enable-sockets' Server API => Command Line Interface Virtual Directory Support => disabled Configuration File (php.ini) Path => /etc/php.ini PHP API => 20020918 PHP Extension => 20020429 Zend Extension => 20021010 Debug Build => no Thread Safety => disabled Registered PHP Streams => php, http, ftp, compress.zlib This program makes use of the Zend Scripting Language Engine: Zend Engine v1.3.0, Copyright (c) 1998-2003 Zend Technologies _______________________________________________________________________ Configuration PHP Core Directive => Local Value => Master Value allow_call_time_pass_reference => Off => Off allow_url_fopen => On => On always_populate_raw_post_data => Off => Off arg_separator.input => & => & arg_separator.output => & => & asp_tags => Off => Off auto_append_file => no value => no value auto_prepend_file => no value => no value browscap => no value => no value default_charset => no value => no value default_mimetype => text/html => text/html define_syslog_variables => Off => Off disable_classes => no value => no value disable_functions => no value => no value display_errors => On => On display_startup_errors => Off => Off doc_root => no value => no value docref_ext => no value => no value docref_root => no value => no value enable_dl => On => On error_append_string => no value => no value error_log => no value => no value error_prepend_string => no value => no value error_reporting => 2047 => 2047 expose_php => On => On extension_dir => /usr/lib/php4/ => /usr/lib/php4/ file_uploads => On => On gpc_order => GPC => GPC highlight.bg => #FFFFFF => #FFFFFF highlight.comment => #FF8000 => #FF8000 highlight.default => #0000BB => #0000BB highlight.html => #000000 => #000000 highlight.keyword => #007700 => #007700 highlight.string => #DD0000 => #DD0000 html_errors => Off => On ignore_repeated_errors => Off => Off ignore_repeated_source => Off => Off ignore_user_abort => Off => Off implicit_flush => On => Off include_path => .:/usr/local/lib/php => .:/usr/local/lib/php log_errors => On => On log_errors_max_len => 1024 => 1024 magic_quotes_gpc => Off => Off magic_quotes_runtime => Off => Off magic_quotes_sybase => Off => Off max_execution_time => 0 => 30 max_input_time => 60 => 60 open_basedir => no value => no value output_buffering => 4096 => 4096 output_handler => no value => no value post_max_size => 8M => 8M precision => 14 => 14 register_argc_argv => On => Off register_globals => Off => Off report_memleaks => On => On safe_mode => Off => Off safe_mode_exec_dir => no value => no value safe_mode_gid => Off => Off safe_mode_include_dir => no value => no value sendmail_from => me@localhost.com => me@localhost.com sendmail_path => /usr/sbin/sendmail -t -i => /usr/sbin/sendmail -t -i serialize_precision => 100 => 100 short_open_tag => On => On SMTP => localhost => localhost smtp_port => 25 => 25 sql.safe_mode => Off => Off track_errors => Off => Off unserialize_callback_func => no value => no value upload_max_filesize => 2M => 2M upload_tmp_dir => no value => no value user_dir => no value => no value variables_order => GPCS => GPCS xmlrpc_error_number => 0 => 0 xmlrpc_errors => Off => Off y2k_compliance => On => On ctype ctype functions => enabled gd GD Support => enabled GD Version => bundled (2.0.12 compatible) GIF Read Support => enabled PNG Support => enabled WBMP Support => enabled XBM Support => enabled mysql MySQL Support => enabled Active Persistent Links => 0 Active Links => 0 Client API version => 3.23.49 MYSQL_MODULE_TYPE => builtin MYSQL_SOCKET => /var/lib/mysql/mysql.sock MYSQL_INCLUDE => MYSQL_LIBS => Directive => Local Value => Master Value mysql.allow_persistent => On => On mysql.connect_timeout => -1 => -1 mysql.default_host => no value => no value mysql.default_password => no value => no value mysql.default_port => no value => no value mysql.default_socket => no value => no value mysql.default_user => no value => no value mysql.max_links => Unlimited => Unlimited mysql.max_persistent => Unlimited => Unlimited mysql.trace_mode => Off => Off overload User-Space Object Overloading Support => enabled pcre PCRE (Perl Compatible Regular Expressions) Support => enabled PCRE Library Version => 3.92 11-Sep-2002 posix Revision => $Revision: 1.51.2.2 $ session Session Support => enabled Registered save handlers => files user Directive => Local Value => Master Value session.auto_start => On => On session.bug_compat_42 => Off => Off session.bug_compat_warn => On => On session.cache_expire => 180 => 180 session.cache_limiter => nocache => nocache session.cookie_domain => no value => no value session.cookie_lifetime => 0 => 0 session.cookie_path => / => / session.cookie_secure => Off => Off session.entropy_file => /dev/urandom => /dev/urandom session.entropy_length => 16 => 16 session.gc_divisor => 100 => 100 session.gc_maxlifetime => 3600 => 3600 session.gc_probability => 1 => 1 session.name => PHPSESSID => PHPSESSID session.referer_check => no value => no value session.save_handler => files => files session.save_path => /tmp/php => /tmp/php session.serialize_handler => php => php session.use_cookies => On => On session.use_only_cookies => Off => Off session.use_trans_sid => Off => Off sockets Sockets Support => enabled standard Regex Library => Bundled library enabled Dynamic Library Support => enabled Path to sendmail => /usr/sbin/sendmail -t -i Directive => Local Value => Master Value assert.active => 1 => 1 assert.bail => 0 => 0 assert.callback => no value => no value assert.quiet_eval => 0 => 0 assert.warning => 1 => 1 auto_detect_line_endings => 0 => 0 default_socket_timeout => 60 => 60 safe_mode_allowed_env_vars => PHP_ => PHP_ safe_mode_protected_env_vars => LD_LIBRARY_PATH => LD_LIBRARY_PATH url_rewriter.tags => a=href,area=href,frame=src,input=src,form=fakeentry => a=href,area=href,frame=src,input=src,form=fakeentry user_agent => no value => no value tokenizer Tokenizer Support => enabled xml XML Support => active XML Namespace Support => active EXPAT Version => 1.95.2 zlib ZLib Support => enabled Compiled Version => 1.1.3 Linked Version => 1.1.3 Directive => Local Value => Master Value zlib.output_compression => Off => Off zlib.output_compression_level => -1 => -1 zlib.output_handler => no value => no value Additional Modules Module Name Environment Variable => Value PWD => /var/ftp/pub/linux_stuff/addons/php/php-4.3.2RC4 MAKEFLAGS => MFLAGS => HOSTNAME => www2.pennysaverusa.com REDIRECT_STATUS => TEST_PHP_EXECUTABLE => /var/ftp/pub/linux_stuff/addons/php/php-4.3.2RC4/sapi/cli/php LESSOPEN => |/usr/bin/lesspipe.sh %s CC => gcc LS_COLORS => USER => root SCRIPT_FILENAME => MAIL => /var/spool/mail/root INPUTRC => /etc/inputrc BASH_ENV => /root/.bashrc PATH_TRANSLATED => EDITOR => emacs LANG => en_US.iso885915 QUERY_STRING => CONTENT_LENGTH => MAKELEVEL => 1 SSH_CLIENT => 146.12.3.25 3144 22 SHLVL => 3 LOGNAME => root _ => /var/ftp/pub/linux_stuff/addons/php/php-4.3.2RC4/sapi/cli/php REQUEST_METHOD => SHELL => /bin/sh USERNAME => root TEST_PHP_SRCDIR => /var/ftp/pub/linux_stuff/addons/php/php-4.3.2RC4 HISTSIZE => 10000 TERM => vt220 HOME => /root SSH_AUTH_SOCK => /tmp/ssh-XXddsYEj/agent.4407 PATH => /usr/local/sbin:/usr/local/bin:/sbin:/bin:/usr/sbin:/usr/bin:/usr/X11R6/bin:/root/bin SSH_TTY => /dev/pts/0 CONTENT_TYPE => PHP Variables Variable => Value _SERVER["PWD"] => /var/ftp/pub/linux_stuff/addons/php/php-4.3.2RC4 _SERVER["MAKEFLAGS"] => _SERVER["MFLAGS"] => _SERVER["HOSTNAME"] => www2.pennysaverusa.com _SERVER["REDIRECT_STATUS"] => _SERVER["TEST_PHP_EXECUTABLE"] => /var/ftp/pub/linux_stuff/addons/php/php-4.3.2RC4/sapi/cli/php _SERVER["LESSOPEN"] => |/usr/bin/lesspipe.sh %s _SERVER["CC"] => gcc _SERVER["LS_COLORS"] => _SERVER["USER"] => root _SERVER["SCRIPT_FILENAME"] => _SERVER["MAIL"] => /var/spool/mail/root _SERVER["INPUTRC"] => /etc/inputrc _SERVER["BASH_ENV"] => /root/.bashrc _SERVER["PATH_TRANSLATED"] => _SERVER["EDITOR"] => emacs _SERVER["LANG"] => en_US.iso885915 _SERVER["QUERY_STRING"] => _SERVER["CONTENT_LENGTH"] => _SERVER["MAKELEVEL"] => 1 _SERVER["SSH_CLIENT"] => 146.12.3.25 3144 22 _SERVER["SHLVL"] => 3 _SERVER["LOGNAME"] => root _SERVER["_"] => /var/ftp/pub/linux_stuff/addons/php/php-4.3.2RC4/sapi/cli/php _SERVER["REQUEST_METHOD"] => _SERVER["SHELL"] => /bin/sh _SERVER["USERNAME"] => root _SERVER["TEST_PHP_SRCDIR"] => /var/ftp/pub/linux_stuff/addons/php/php-4.3.2RC4 _SERVER["HISTSIZE"] => 10000 _SERVER["TERM"] => vt220 _SERVER["HOME"] => /root _SERVER["SSH_AUTH_SOCK"] => /tmp/ssh-XXddsYEj/agent.4407 _SERVER["PATH"] => /usr/local/sbin:/usr/local/bin:/sbin:/bin:/usr/sbin:/usr/bin:/usr/X11R6/bin:/root/bin _SERVER["SSH_TTY"] => /dev/pts/0 _SERVER["CONTENT_TYPE"] => _SERVER["PHP_SELF"] => _SERVER["SCRIPT_NAME"] => _SERVER["DOCUMENT_ROOT"] => _SERVER["argv"] => Array ( ) _SERVER["argc"] => 0 PHP License This program is free software; you can redistribute it and/or modify it under the terms of the PHP License as published by the PHP Group and included in the distribution in the file: LICENSE This program is distributed in the hope that it will be useful, but WITHOUT ANY WARRANTY; without even the implied warranty of MERCHANTABILITY or FITNESS FOR A PARTICULAR PURPOSE. If you did not receive a copy of the PHP license, or have any questions about PHP licensing, please contact license@php.net.

« previous php.qa (#12912) next »