Test results for unknown [failed]

From: Date: Thu, 22 May 2003 20:39:44 +0000
Subject: Test results for unknown [failed]
Groups: php.qa 
Request: Send a blank email to php-qa+get-12913@lists.php.net to get a copy of this message
===================================================================== FAILED TEST SUMMARY --------------------------------------------------------------------- DBA File Creation Test [ext/dba/tests/dba001.phpt] (info: DB3 handler used) DBA Insert/Fetch Test [ext/dba/tests/dba002.phpt] (info: DB3 handler used) DBA Insert/Replace/Fetch Test [ext/dba/tests/dba003.phpt] (info: DB3 handler used) DBA Multiple Insert/Fetch Test [ext/dba/tests/dba004.phpt] (info: DB3 handler used) DBA FirstKey/NextKey Loop Test With 5 Items [ext/dba/tests/dba005.phpt] (info: DB3 handler used) DBA FirstKey/NextKey with 2 deletes [ext/dba/tests/dba006.phpt] (info: DB3 handler used) DBA Multiple File Creation Test [ext/dba/tests/dba007.phpt] (info: DB3 handler used) DBA magic_quotes_runtime Test [ext/dba/tests/dba008.phpt] (info: DB3 handler used) OpenSSL private key functions [ext/openssl/tests/001.phpt] Bug #21131: fopen($filename, "a+") has broken position [ext/standard/tests/file/bug21131.phpt] strtotime() function [ext/standard/tests/time/002.phpt] ===================================================================== ===================================================================== TEST RESULT SUMMARY --------------------------------------------------------------------- Exts skipped : 71 Exts tested : 17 --------------------------------------------------------------------- Number of tests : 443 Tests skipped : 214 (48.3%) Tests failed : 11 ( 2.5%) Tests passed : 218 (49.2%) --------------------------------------------------------------------- Time taken : 157 seconds ===================================================================== ================================================================================ /usr/share/src/php/php-4.3.1/ext/dba/tests/dba001.phpt ================================================================================ ---- EXPECTED OUTPUT database handler: %s database file created ---- ACTUAL OUTPUT database handler: db3 Warning: dba_open(/usr/share/src/php/php-4.3.1/ext/dba/tests/test0.dbm,n) [/phpmanual/function.dba-open.html]: Driver initialization failed for handler: db3 in /usr/share/src/php/php-4.3.1/ext/dba/tests/dba001.php on line 4 does not exist ---- FAILED ================================================================================ 001- database handler: %s 001+ database handler: db3 002- database file created 002+ 003+ Warning: dba_open(/usr/share/src/php/php-4.3.1/ext/dba/tests/test0.dbm,n) [/phpmanual/function.dba-open.html]: Driver initialization failed for handler: db3 in /usr/share/src/php/php-4.3.1/ext/dba/tests/dba001.php on line 4 004+ does not exist ================================================================================ ================================================================================ /usr/share/src/php/php-4.3.1/ext/dba/tests/dba002.phpt ================================================================================ ---- EXPECTED OUTPUT database handler: %s This is a test insert ---- ACTUAL OUTPUT database handler: db3 Warning: dba_open(/usr/share/src/php/php-4.3.1/ext/dba/tests/test0.dbm,n) [/phpmanual/function.dba-open.html]: Driver initialization failed for handler: db3 in /usr/share/src/php/php-4.3.1/ext/dba/tests/dba002.php on line 4 Error creating database ---- FAILED ================================================================================ 001- database handler: %s 001+ database handler: db3 002- This is a test insert 002+ 003+ Warning: dba_open(/usr/share/src/php/php-4.3.1/ext/dba/tests/test0.dbm,n) [/phpmanual/function.dba-open.html]: Driver initialization failed for handler: db3 in /usr/share/src/php/php-4.3.1/ext/dba/tests/dba002.php on line 4 004+ Error creating database ================================================================================ ================================================================================ /usr/share/src/php/php-4.3.1/ext/dba/tests/dba003.phpt ================================================================================ ---- EXPECTED OUTPUT database handler: %s This is the replacement text ---- ACTUAL OUTPUT database handler: db3 Warning: dba_open(/usr/share/src/php/php-4.3.1/ext/dba/tests/test0.dbm,n) [/phpmanual/function.dba-open.html]: Driver initialization failed for handler: db3 in /usr/share/src/php/php-4.3.1/ext/dba/tests/dba003.php on line 4 Error creating database ---- FAILED ================================================================================ 001- database handler: %s 001+ database handler: db3 002- This is the replacement text 002+ 003+ Warning: dba_open(/usr/share/src/php/php-4.3.1/ext/dba/tests/test0.dbm,n) [/phpmanual/function.dba-open.html]: Driver initialization failed for handler: db3 in /usr/share/src/php/php-4.3.1/ext/dba/tests/dba003.php on line 4 004+ Error creating database ================================================================================ ================================================================================ /usr/share/src/php/php-4.3.1/ext/dba/tests/dba004.phpt ================================================================================ ---- EXPECTED OUTPUT database handler: %s Another Content String Content String 2 ---- ACTUAL OUTPUT database handler: db3 Warning: dba_open(/usr/share/src/php/php-4.3.1/ext/dba/tests/test0.dbm,n) [/phpmanual/function.dba-open.html]: Driver initialization failed for handler: db3 in /usr/share/src/php/php-4.3.1/ext/dba/tests/dba004.php on line 4 Error creating database ---- FAILED ================================================================================ 001- database handler: %s 001+ database handler: db3 002- Another Content String Content String 2 002+ 003+ Warning: dba_open(/usr/share/src/php/php-4.3.1/ext/dba/tests/test0.dbm,n) [/phpmanual/function.dba-open.html]: Driver initialization failed for handler: db3 in /usr/share/src/php/php-4.3.1/ext/dba/tests/dba004.php on line 4 004+ Error creating database ================================================================================ ================================================================================ /usr/share/src/php/php-4.3.1/ext/dba/tests/dba005.phpt ================================================================================ ---- EXPECTED OUTPUT database handler: %s 5YYYYY ---- ACTUAL OUTPUT database handler: db3 Warning: dba_open(/usr/share/src/php/php-4.3.1/ext/dba/tests/test0.dbm,n) [/phpmanual/function.dba-open.html]: Driver initialization failed for handler: db3 in /usr/share/src/php/php-4.3.1/ext/dba/tests/dba005.php on line 4 Error creating database ---- FAILED ================================================================================ 001- database handler: %s 001+ database handler: db3 002- 5YYYYY 002+ 003+ Warning: dba_open(/usr/share/src/php/php-4.3.1/ext/dba/tests/test0.dbm,n) [/phpmanual/function.dba-open.html]: Driver initialization failed for handler: db3 in /usr/share/src/php/php-4.3.1/ext/dba/tests/dba005.php on line 4 004+ Error creating database ================================================================================ ================================================================================ /usr/share/src/php/php-4.3.1/ext/dba/tests/dba006.phpt ================================================================================ ---- EXPECTED OUTPUT database handler: %s 3NYNYY ---- ACTUAL OUTPUT database handler: db3 Warning: dba_open(/usr/share/src/php/php-4.3.1/ext/dba/tests/test0.dbm,n) [/phpmanual/function.dba-open.html]: Driver initialization failed for handler: db3 in /usr/share/src/php/php-4.3.1/ext/dba/tests/dba006.php on line 4 Error creating database ---- FAILED ================================================================================ 001- database handler: %s 001+ database handler: db3 002- 3NYNYY 002+ 003+ Warning: dba_open(/usr/share/src/php/php-4.3.1/ext/dba/tests/test0.dbm,n) [/phpmanual/function.dba-open.html]: Driver initialization failed for handler: db3 in /usr/share/src/php/php-4.3.1/ext/dba/tests/dba006.php on line 4 004+ Error creating database ================================================================================ ================================================================================ /usr/share/src/php/php-4.3.1/ext/dba/tests/dba007.phpt ================================================================================ ---- EXPECTED OUTPUT database handler: %s database file created database file created database file created array(3) { [%d]=> string(%d) "%sext/dba/tests/test0.dbm" [%d]=> string(%d) "%sext/dba/tests/test1.dbm" [%d]=> string(%d) "%sext/dba/tests/test2.dbm" } ---- ACTUAL OUTPUT database handler: db3 Warning: dba_open(/usr/share/src/php/php-4.3.1/ext/dba/tests/test0.dbm,n) [/phpmanual/function.dba-open.html]: Driver initialization failed for handler: db3 in /usr/share/src/php/php-4.3.1/ext/dba/tests/dba007.php on line 6 does not exist Warning: dba_open(/usr/share/src/php/php-4.3.1/ext/dba/tests/test1.dbm,n) [/phpmanual/function.dba-open.html]: Driver initialization failed for handler: db3 in /usr/share/src/php/php-4.3.1/ext/dba/tests/dba007.php on line 11 does not exist Warning: dba_open(/usr/share/src/php/php-4.3.1/ext/dba/tests/test2.dbm,n) [/phpmanual/function.dba-open.html]: Driver initialization failed for handler: db3 in /usr/share/src/php/php-4.3.1/ext/dba/tests/dba007.php on line 16 does not exist array(0) { } Warning: dba_close(): supplied argument is not a valid DBA identifier resource in /usr/share/src/php/php-4.3.1/ext/dba/tests/dba007.php on line 22 ---- FAILED ================================================================================ 001- database handler: %s 001+ database handler: db3 002- database file created 002+ 003- database file created 003+ Warning: dba_open(/usr/share/src/php/php-4.3.1/ext/dba/tests/test0.dbm,n) [/phpmanual/function.dba-open.html]: Driver initialization failed for handler: db3 in /usr/share/src/php/php-4.3.1/ext/dba/tests/dba007.php on line 6 004- database file created 004+ does not exist 005- array(3) { 005+ 006- [%d]=> 006+ Warning: dba_open(/usr/share/src/php/php-4.3.1/ext/dba/tests/test1.dbm,n) [/phpmanual/function.dba-open.html]: Driver initialization failed for handler: db3 in /usr/share/src/php/php-4.3.1/ext/dba/tests/dba007.php on line 11 007- string(%d) "%sext/dba/tests/test0.dbm" 007+ does not exist 008- [%d]=> 008+ 009- string(%d) "%sext/dba/tests/test1.dbm" 009+ Warning: dba_open(/usr/share/src/php/php-4.3.1/ext/dba/tests/test2.dbm,n) [/phpmanual/function.dba-open.html]: Driver initialization failed for handler: db3 in /usr/share/src/php/php-4.3.1/ext/dba/tests/dba007.php on line 16 010- [%d]=> 010+ does not exist 011- string(%d) "%sext/dba/tests/test2.dbm" 011+ array(0) { 013+ 014+ Warning: dba_close(): supplied argument is not a valid DBA identifier resource in /usr/share/src/php/php-4.3.1/ext/dba/tests/dba007.php on line 22 ================================================================================ ================================================================================ /usr/share/src/php/php-4.3.1/ext/dba/tests/dba008.phpt ================================================================================ ---- EXPECTED OUTPUT database handler: %s string(1) """ string(2) "\"" string(2) "\"" string(1) """ ---- ACTUAL OUTPUT database handler: db3 Warning: dba_open(/usr/share/src/php/php-4.3.1/ext/dba/tests/test0.dbm,n) [/phpmanual/function.dba-open.html]: Driver initialization failed for handler: db3 in /usr/share/src/php/php-4.3.1/ext/dba/tests/dba008.php on line 4 Error creating database ---- FAILED ================================================================================ 001- database handler: %s 001+ database handler: db3 002- string(1) """ 002+ 003- string(2) "\"" 003+ Warning: dba_open(/usr/share/src/php/php-4.3.1/ext/dba/tests/test0.dbm,n) [/phpmanual/function.dba-open.html]: Driver initialization failed for handler: db3 in /usr/share/src/php/php-4.3.1/ext/dba/tests/dba008.php on line 4 004- string(2) "\"" 004+ Error creating database 005- string(1) """ ================================================================================ ================================================================================ /usr/share/src/php/php-4.3.1/ext/openssl/tests/001.phpt ================================================================================ ---- EXPECTED OUTPUT Creating private key Export key to file Load key from file - array syntax Load key using direct syntax Load key manually and use string syntax OK! ---- ACTUAL OUTPUT Creating private key Warning: openssl_pkey_new() [/phpmanual/function.openssl-pkey-new.html]: unable to load random state; not enough random data! in /usr/share/src/php/php-4.3.1/ext/openssl/tests/001.php on line 13 failed to create private key ---- FAILED ================================================================================ 002- Export key to file 002+ 003- Load key from file - array syntax 003+ Warning: openssl_pkey_new() [/phpmanual/function.openssl-pkey-new.html]: unable to load random state; not enough random data! in /usr/share/src/php/php-4.3.1/ext/openssl/tests/001.php on line 13 004- Load key using direct syntax 004+ failed to create private key 005- Load key manually and use string syntax 006- OK! ================================================================================ ================================================================================ /usr/share/src/php/php-4.3.1/ext/standard/tests/file/bug21131.phpt ================================================================================ ---- EXPECTED OUTPUT int(6) int(0) foobar ---- ACTUAL OUTPUT int(0) int(0) foobar ---- FAILED ================================================================================ 001- int(6) 001+ int(0) ================================================================================ ================================================================================ /usr/share/src/php/php-4.3.1/ext/standard/tests/time/002.phpt ================================================================================ ---- EXPECTED OUTPUT 1999-10-13 00:00:00 1999-10-13 00:00:00 2000-01-19 00:00:00 2000-01-19 00:00:00 2001-12-21 00:00:00 2001-12-21 00:00:00 2001-12-21 12:16:00 2001-12-21 12:16:00 1969-12-31 23:59:59 2001-10-22 21:19:58 2001-10-22 23:19:58 2001-10-22 23:32:58 2001-10-22 19:19:58 2001-10-22 19:06:58 1999-10-13 00:00:00 1999-10-13 00:00:00 2000-01-19 00:00:00 2000-01-19 00:00:00 2001-12-21 00:00:00 2001-12-21 00:00:00 2001-12-21 12:16:00 2001-12-21 12:16:00 1970-01-01 00:59:59 2001-10-22 21:19:58 2001-10-23 01:19:58 2001-10-23 01:32:58 2001-10-22 21:19:58 2001-10-22 21:06:58 ---- ACTUAL OUTPUT 1999-10-13 00:00:00 1999-10-13 00:00:00 2000-01-19 00:00:00 2000-01-19 00:00:00 2001-12-21 00:00:00 2001-12-21 00:00:00 2001-12-21 12:16:00 2001-12-21 12:16:00 1969-12-31 23:59:59 2001-10-22 21:19:58 2001-10-22 23:19:58 2001-10-22 23:32:58 2001-10-22 19:19:58 2001-10-22 19:06:58 1999-10-13 00:00:00 1999-10-13 00:00:00 2000-01-19 00:00:00 2000-01-19 00:00:00 2001-12-21 00:00:00 2001-12-21 00:00:00 2001-12-21 12:16:00 2001-12-21 12:16:00 1969-12-31 23:59:59 2001-10-22 21:19:58 2001-10-22 23:19:58 2001-10-22 23:32:58 2001-10-22 19:19:58 2001-10-22 19:06:58 ---- FAILED ================================================================================ 023- 1970-01-01 00:59:59 023+ 1969-12-31 23:59:59 025- 2001-10-23 01:19:58 025+ 2001-10-22 23:19:58 026- 2001-10-23 01:32:58 026+ 2001-10-22 23:32:58 027- 2001-10-22 21:19:58 027+ 2001-10-22 19:19:58 028- 2001-10-22 21:06:58 028+ 2001-10-22 19:06:58 ================================================================================ ================================================================================ BUILD ENVIRONMENT ================================================================================ OS: SunOS Automake: Autoconf: Libtool: ltmain.sh (GNU libtool) 1.4.2 (1.922.2.53 2001/09/11 03:18:52) Compiler: Reading specs from /usr/local/lib/gcc-lib/sparc-sun-solaris2.8/3.2.1/specs Configured with: ../configure --disable-nls --with-as=/usr/ccs/bin/as --with-ld=/usr/ccs/bin/ld Thread model: posix gcc version 3.2.1 Bison: User's E-mail: john dot hillman at shermonster dot oer ================================================================================ PHPINFO ================================================================================ phpinfo() PHP Version => 4.3.1 System => SunOS www2 5.8 Generic_108528-18 sun4u Build Date => May 22 2003 15:38:53 Configure Command => './configure' '--enable-shared' '--with-mysql=/usr/local' '--with-gettext=/usr/local' '--with-db3' '--prefix=/usr/local/php' '--with-openssl' '--with-apxs2=/usr/local/apache2/bin/apxs' '--with-bz2=/usr/local' '--enable-ftp' '--enable-sockets' '--with-png-dir=/usr/local' '--with-jpeg-dir=/usr/local' '--with-gd=/usr/local' '--with-zlib=/usr/local' Server API => Command Line Interface Virtual Directory Support => disabled Configuration File (php.ini) Path => /usr/local/php/lib/php.ini PHP API => 20020918 PHP Extension => 20020429 Zend Extension => 20021010 Debug Build => no Thread Safety => disabled Registered PHP Streams => php, http, ftp, https, ftps, compress.bzip2, compress.zlib This program makes use of the Zend Scripting Language Engine: Zend Engine v1.3.0, Copyright (c) 1998-2002 Zend Technologies _______________________________________________________________________ Configuration PHP Core Directive => Local Value => Master Value allow_call_time_pass_reference => On => On allow_url_fopen => On => On always_populate_raw_post_data => Off => Off arg_separator.input => & => & arg_separator.output => & => & asp_tags => Off => Off auto_append_file => no value => no value auto_prepend_file => no value => no value browscap => no value => no value default_charset => no value => no value default_mimetype => text/html => text/html define_syslog_variables => Off => Off disable_functions => no value => no value display_errors => On => On display_startup_errors => Off => Off doc_root => /usr/local/apache2/htdocs => /usr/local/apache2/htdocs docref_ext => no value => no value docref_root => http://www.php.net/ => http://www.php.net/ enable_dl => On => On error_append_string => no value => no value error_log => no value => no value error_prepend_string => no value => no value error_reporting => 2039 => 2039 expose_php => On => On extension_dir => ./ => ./ file_uploads => On => On gpc_order => GPC => GPC highlight.bg => #FFFFFF => #FFFFFF highlight.comment => #FF8000 => #FF8000 highlight.default => #0000BB => #0000BB highlight.html => #000000 => #000000 highlight.keyword => #007700 => #007700 highlight.string => #DD0000 => #DD0000 html_errors => Off => On ignore_repeated_errors => Off => Off ignore_repeated_source => Off => Off ignore_user_abort => Off => Off implicit_flush => On => Off include_path => .:/usr/local/php/lib/php => .:/usr/local/php/lib/php log_errors => Off => Off log_errors_max_len => 1024 => 1024 magic_quotes_gpc => On => On magic_quotes_runtime => Off => Off magic_quotes_sybase => Off => Off max_execution_time => 0 => 30 max_input_time => 60 => 60 open_basedir => no value => no value output_buffering => no value => no value output_handler => no value => no value post_max_size => 8M => 8M precision => 12 => 12 register_argc_argv => On => On register_globals => Off => Off report_memleaks => On => On safe_mode => Off => Off safe_mode_exec_dir => no value => no value safe_mode_gid => Off => Off safe_mode_include_dir => no value => no value sendmail_from => me@localhost.com => me@localhost.com sendmail_path => /usr/lib/sendmail -t -i => /usr/lib/sendmail -t -i short_open_tag => On => On SMTP => localhost => localhost smtp_port => 25 => 25 sql.safe_mode => Off => Off track_errors => Off => Off unserialize_callback_func => no value => no value upload_max_filesize => 2M => 2M upload_tmp_dir => no value => no value user_dir => no value => no value variables_order => EGPCS => EGPCS xmlrpc_error_number => 0 => 0 xmlrpc_errors => Off => Off y2k_compliance => On => On bz2 BZip2 Support => Enabled BZip2 Version => 1.0.2, 30-Dec-2001 ctype ctype functions => enabled dba DBA support => enabled Supported handlers => db3 ftp FTP support => enabled gd GD Support => enabled GD Version => 2.0 or higher JPG Support => enabled PNG Support => enabled WBMP Support => enabled gettext GetText Support => enabled mysql MySQL Support => enabled Active Persistent Links => 0 Active Links => 0 Client API version => 4.0.12 MYSQL_MODULE_TYPE => external MYSQL_SOCKET => /tmp/mysql.sock MYSQL_INCLUDE => -I/usr/local/include/mysql MYSQL_LIBS => -L/usr/local/lib -lmysqlclient Directive => Local Value => Master Value mysql.allow_persistent => On => On mysql.connect_timeout => -1 => -1 mysql.default_host => sql.ridewide.net => sql.ridewide.net mysql.default_password => no value => no value mysql.default_port => no value => no value mysql.default_socket => no value => no value mysql.default_user => no value => no value mysql.max_links => Unlimited => Unlimited mysql.max_persistent => Unlimited => Unlimited mysql.trace_mode => Off => Off openssl OpenSSL support => enabled OpenSSL Version => OpenSSL 0.9.7a Feb 19 2003 overload User-Space Object Overloading Support => enabled pcre PCRE (Perl Compatible Regular Expressions) Support => enabled PCRE Library Version => 3.92 11-Sep-2002 posix Revision => $Revision: 1.51 $ session Session Support => enabled Registered save handlers => files user Directive => Local Value => Master Value session.auto_start => Off => Off session.bug_compat_42 => On => On session.bug_compat_warn => On => On session.cache_expire => 180 => 180 session.cache_limiter => nocache => nocache session.cookie_domain => no value => no value session.cookie_lifetime => 0 => 0 session.cookie_path => / => / session.cookie_secure => Off => Off session.entropy_file => no value => no value session.entropy_length => 0 => 0 session.gc_dividend => 100 => 100 session.gc_maxlifetime => 1440 => 1440 session.gc_probability => 1 => 1 session.name => PHPSESSID => PHPSESSID session.referer_check => no value => no value session.save_handler => files => files session.save_path => /tmp => /tmp session.serialize_handler => php => php session.use_cookies => On => On session.use_only_cookies => Off => Off session.use_trans_sid => Off => Off sockets Sockets Support => enabled standard Regex Library => Bundled library enabled Dynamic Library Support => enabled Path to sendmail => /usr/lib/sendmail -t -i Directive => Local Value => Master Value assert.active => 1 => 1 assert.bail => 0 => 0 assert.callback => no value => no value assert.quiet_eval => 0 => 0 assert.warning => 1 => 1 auto_detect_line_endings => 0 => 0 default_socket_timeout => 60 => 60 safe_mode_allowed_env_vars => PHP_ => PHP_ safe_mode_protected_env_vars => LD_LIBRARY_PATH => LD_LIBRARY_PATH url_rewriter.tags => a=href,area=href,frame=src,input=src,form=,fieldset= => a=href,area=href,frame=src,input=src,form=,fieldset= user_agent => no value => no value tokenizer Tokenizer Support => enabled xml XML Support => active XML Namespace Support => active EXPAT Version => 1.95.2 zlib ZLib Support => enabled Compiled Version => 1.1.4 Linked Version => 1.1.4 Directive => Local Value => Master Value zlib.output_compression => Off => Off zlib.output_compression_level => -1 => -1 zlib.output_handler => no value => no value Additional Modules Module Name Environment Variable => Value CC => /usr/local/bin/gcc CFLAGS => -O2 -prefer-pic CONTENT_LENGTH => CONTENT_TYPE => HOME => / LDFLAGS => -L/usr/local/lib -R/usr/local/lib LD_RUN_PATH => /usr/local/lib LOGNAME => root MAIL => /var/mail/root MAKEFLAGS => MAKELEVEL => 1 MFLAGS => NNTPSERVER => news.sgn.sbcglobal.net PATH => /usr/local/bin:/var/qmail/bin:/home/vpopmail/bin:/usr/local/mysql/bin:/usr/bin:/bin:/usr/sbin:/sbin:/usr/ccs/bin:/usr/ucb PATH_TRANSLATED => QUERY_STRING => REDIRECT_STATUS => REQUEST_METHOD => SCRIPT_FILENAME => SHELL => /bin/sh SSH2_AUTH_SOCK => /tmp/ssh-root/ssh2-29375-agent SSH2_CLIENT => 198.109.0.239 3567 192.168.254.103 22 SSH2_SFTP_LOG_FACILITY => -1 SSH_AA_SOCK => /tmp/ssh-root/ssh2-29375-agent TERM => vt100 TEST_PHP_EXECUTABLE => /usr/share/src/php/php-4.3.1/sapi/cli/php TEST_PHP_SRCDIR => /usr/share/src/php/php-4.3.1 TZ => US/Michigan USER => root PHP Variables Variable => Value _SERVER["CC"] => /usr/local/bin/gcc _SERVER["CFLAGS"] => -O2 -prefer-pic _SERVER["CONTENT_LENGTH"] => _SERVER["CONTENT_TYPE"] => _SERVER["HOME"] => / _SERVER["LDFLAGS"] => -L/usr/local/lib -R/usr/local/lib _SERVER["LD_RUN_PATH"] => /usr/local/lib _SERVER["LOGNAME"] => root _SERVER["MAIL"] => /var/mail/root _SERVER["MAKEFLAGS"] => _SERVER["MAKELEVEL"] => 1 _SERVER["MFLAGS"] => _SERVER["NNTPSERVER"] => news.sgn.sbcglobal.net _SERVER["PATH"] => /usr/local/bin:/var/qmail/bin:/home/vpopmail/bin:/usr/local/mysql/bin:/usr/bin:/bin:/usr/sbin:/sbin:/usr/ccs/bin:/usr/ucb _SERVER["PATH_TRANSLATED"] => _SERVER["QUERY_STRING"] => _SERVER["REDIRECT_STATUS"] => _SERVER["REQUEST_METHOD"] => _SERVER["SCRIPT_FILENAME"] => _SERVER["SHELL"] => /bin/sh _SERVER["SSH2_AUTH_SOCK"] => /tmp/ssh-root/ssh2-29375-agent _SERVER["SSH2_CLIENT"] => 198.109.0.239 3567 192.168.254.103 22 _SERVER["SSH2_SFTP_LOG_FACILITY"] => -1 _SERVER["SSH_AA_SOCK"] => /tmp/ssh-root/ssh2-29375-agent _SERVER["TERM"] => vt100 _SERVER["TEST_PHP_EXECUTABLE"] => /usr/share/src/php/php-4.3.1/sapi/cli/php _SERVER["TEST_PHP_SRCDIR"] => /usr/share/src/php/php-4.3.1 _SERVER["TZ"] => US/Michigan _SERVER["USER"] => root _SERVER["PHP_SELF"] => _SERVER["SCRIPT_NAME"] => _SERVER["DOCUMENT_ROOT"] => _SERVER["argv"] => Array ( ) _SERVER["argc"] => 0 _ENV["CC"] => /usr/local/bin/gcc _ENV["CFLAGS"] => -O2 -prefer-pic _ENV["CONTENT_LENGTH"] => _ENV["CONTENT_TYPE"] => _ENV["HOME"] => / _ENV["LDFLAGS"] => -L/usr/local/lib -R/usr/local/lib _ENV["LD_RUN_PATH"] => /usr/local/lib _ENV["LOGNAME"] => root _ENV["MAIL"] => /var/mail/root _ENV["MAKEFLAGS"] => _ENV["MAKELEVEL"] => 1 _ENV["MFLAGS"] => _ENV["NNTPSERVER"] => news.sgn.sbcglobal.net _ENV["PATH"] => /usr/local/bin:/var/qmail/bin:/home/vpopmail/bin:/usr/local/mysql/bin:/usr/bin:/bin:/usr/sbin:/sbin:/usr/ccs/bin:/usr/ucb _ENV["PATH_TRANSLATED"] => _ENV["QUERY_STRING"] => _ENV["REDIRECT_STATUS"] => _ENV["REQUEST_METHOD"] => _ENV["SCRIPT_FILENAME"] => _ENV["SHELL"] => /bin/sh _ENV["SSH2_AUTH_SOCK"] => /tmp/ssh-root/ssh2-29375-agent _ENV["SSH2_CLIENT"] => 198.109.0.239 3567 192.168.254.103 22 _ENV["SSH2_SFTP_LOG_FACILITY"] => -1 _ENV["SSH_AA_SOCK"] => /tmp/ssh-root/ssh2-29375-agent _ENV["TERM"] => vt100 _ENV["TEST_PHP_EXECUTABLE"] => /usr/share/src/php/php-4.3.1/sapi/cli/php _ENV["TEST_PHP_SRCDIR"] => /usr/share/src/php/php-4.3.1 _ENV["TZ"] => US/Michigan _ENV["USER"] => root PHP License This program is free software; you can redistribute it and/or modify it under the terms of the PHP License as published by the PHP Group and included in the distribution in the file: LICENSE This program is distributed in the hope that it will be useful, but WITHOUT ANY WARRANTY; without even the implied warranty of MERCHANTABILITY or FITNESS FOR A PARTICULAR PURPOSE. If you did not receive a copy of the PHP license, or have any questions about PHP licensing, please contact license@php.net.

« previous php.qa (#12913) next »