Test results for 5.0.0b1 [failed]

From: Date: Mon, 30 Jun 2003 11:16:41 +0000
Subject: Test results for 5.0.0b1 [failed]
Groups: php.qa 
Request: Send a blank email to php-qa+get-14623@lists.php.net to get a copy of this message
===================================================================== FAILED TEST SUMMARY --------------------------------------------------------------------- Methods via variable name, bug #20120 [tests/classes/bug20120.phpt] Bug #22367 (weird zval allocation problem) [tests/lang/bug22367.phpt] Bug #23624 (foreach leaves current array key as null) [tests/lang/bug23624.phpt] IPv6 Loopback test [ext/sockets/tests/ipv6loop.phpt] aggregating everything [ext/standard/tests/aggregation/aggregate.phpt] aggregating all methods [ext/standard/tests/aggregation/aggregate_methods.phpt] aggregating methods specified in the list [ext/standard/tests/aggregation/aggregate_methods_by_list.phpt] aggregating methods matching regular expression [ext/standard/tests/aggregation/aggregate_methods_by_regexp.phpt] aggregating all default properties [ext/standard/tests/aggregation/aggregate_properties.phpt] aggregating default properties specified in the list [ext/standard/tests/aggregation/aggregate_properties_by_list.phpt] retrieving aggregation info [ext/standard/tests/aggregation/aggregation_info.phpt] deaggreating [ext/standard/tests/aggregation/deaggregate.phpt] date_sunrise() and date_sunset() functions [ext/standard/tests/general_functions/sunfuncts.phpt] XML parser test, function callbacks [ext/xml/tests/xml001.phpt] XML parser test, object tuple callbacks [ext/xml/tests/xml002.phpt] XML parser test, xml_set_object callbacks [ext/xml/tests/xml003.phpt] ===================================================================== ===================================================================== TEST RESULT SUMMARY --------------------------------------------------------------------- Exts skipped : 53 Exts tested : 29 --------------------------------------------------------------------- Number of tests : 631 Tests skipped : 142 (22.5%) Tests warned : 0 ( 0.0%) Tests failed : 16 ( 2.5%) Tests passed : 473 (75.0%) --------------------------------------------------------------------- Time taken : 146 seconds ===================================================================== ===================================================================== FAILED TEST SUMMARY --------------------------------------------------------------------- Methods via variable name, bug #20120 [tests/classes/bug20120.phpt] Bug #22367 (weird zval allocation problem) [tests/lang/bug22367.phpt] Bug #23624 (foreach leaves current array key as null) [tests/lang/bug23624.phpt] IPv6 Loopback test [ext/sockets/tests/ipv6loop.phpt] aggregating everything [ext/standard/tests/aggregation/aggregate.phpt] aggregating all methods [ext/standard/tests/aggregation/aggregate_methods.phpt] aggregating methods specified in the list [ext/standard/tests/aggregation/aggregate_methods_by_list.phpt] aggregating methods matching regular expression [ext/standard/tests/aggregation/aggregate_methods_by_regexp.phpt] aggregating all default properties [ext/standard/tests/aggregation/aggregate_properties.phpt] aggregating default properties specified in the list [ext/standard/tests/aggregation/aggregate_properties_by_list.phpt] retrieving aggregation info [ext/standard/tests/aggregation/aggregation_info.phpt] deaggreating [ext/standard/tests/aggregation/deaggregate.phpt] date_sunrise() and date_sunset() functions [ext/standard/tests/general_functions/sunfuncts.phpt] XML parser test, function callbacks [ext/xml/tests/xml001.phpt] XML parser test, object tuple callbacks [ext/xml/tests/xml002.phpt] XML parser test, xml_set_object callbacks [ext/xml/tests/xml003.phpt] ===================================================================== ================================================================================ /root/php5/php-5.0.0b1/tests/classes/bug20120.phpt ================================================================================ ---- EXPECTED OUTPUT test test2 test2 ---- ACTUAL OUTPUT Parse error: parse error in /root/php5/php-5.0.0b1/tests/classes/bug20120.php on line 11 ---- FAILED ================================================================================ 001- test 001+ Parse error: parse error in /root/php5/php-5.0.0b1/tests/classes/bug20120.php on line 11 002- test2 003- test2 ================================================================================ ================================================================================ /root/php5/php-5.0.0b1/tests/lang/bug22367.phpt ================================================================================ ---- EXPECTED OUTPUT int(5) bool(false) bool(false) array(5) { [0]=> int(0) [1]=> int(1) [2]=> int(2) [3]=> int(3) [4]=> int(4) } array(5) { [0]=> int(0) [1]=> int(1) [2]=> int(2) [3]=> int(3) [4]=> int(4) } int(2) bool(true) bool(true) array(5) { [0]=> int(0) [1]=> int(1) [2]=> int(2) [3]=> int(3) [4]=> int(4) } array(5) { [0]=> int(0) [1]=> int(1) [2]=> int(2) [3]=> int(3) [4]=> int(4) } ---- ACTUAL OUTPUT int(5) bool(false) bool(false) array(5) { [0]=> int(4) [1]=> int(4) [2]=> int(4) [3]=> int(4) [4]=> int(4) } array(5) { [0]=> int(0) [1]=> int(1) [2]=> int(2) [3]=> int(3) [4]=> int(4) } int(2) bool(true) bool(true) array(5) { [0]=> int(0) [1]=> int(1) [2]=> int(2) [3]=> int(3) [4]=> int(4) } array(5) { [0]=> int(0) [1]=> int(1) [2]=> &int(2) [3]=> int(3) [4]=> int(4) } ---- FAILED ================================================================================ 006- int(0) 006+ int(4) 008- int(1) 008+ int(4) 010- int(2) 010+ int(4) 012- int(3) 012+ int(4) 049- int(2) 049+ &int(2) ================================================================================ ================================================================================ /root/php5/php-5.0.0b1/tests/lang/bug23624.phpt ================================================================================ ---- EXPECTED OUTPUT string(3) "one" string(5) "three" ---- ACTUAL OUTPUT string(3) "one" bool(false) ---- FAILED ================================================================================ 002- string(5) "three" 002+ bool(false) ================================================================================ ================================================================================ /root/php5/php-5.0.0b1/ext/sockets/tests/ipv6loop.phpt ================================================================================ ---- EXPECTED OUTPUT string(10) "ABCdef123 " ---- ACTUAL OUTPUT Warning: socket_create(): Unable to create socket [97]: Address family not supported by protocol in /root/php5/php-5.0.0b1/ext/sockets/tests/ipv6loop.php on line 3 Unable to create AF_INET6 socket [server] ---- FAILED ================================================================================ 001- string(10) "ABCdef123 001+ Warning: socket_create(): Unable to create socket [97]: Address family not supported by protocol in /root/php5/php-5.0.0b1/ext/sockets/tests/ipv6loop.php on line 3 002- " 002+ Unable to create AF_INET6 socket [server] ================================================================================ ================================================================================ /root/php5/php-5.0.0b1/ext/standard/tests/aggregation/aggregate.phpt ================================================================================ ---- EXPECTED OUTPUT I'm alive! I'm helping! I'm aggregating! **** ---- ACTUAL OUTPUT I'm alive! Fatal error: Call to undefined function: aggregate() in /root/php5/php-5.0.0b1/ext/standard/tests/aggregation/aggregate.php on line 6 ---- FAILED ================================================================================ 002- I'm helping! 002+ 003- I'm aggregating! 003+ Fatal error: Call to undefined function: aggregate() in /root/php5/php-5.0.0b1/ext/standard/tests/aggregation/aggregate.php on line 6 004- **** ================================================================================ ================================================================================ /root/php5/php-5.0.0b1/ext/standard/tests/aggregation/aggregate_methods.phpt ================================================================================ ---- EXPECTED OUTPUT I'm alive! mixing 100 simple,mix_it simple_prop mixing ---- ACTUAL OUTPUT I'm alive! Fatal error: Call to undefined function: aggregate_methods() in /root/php5/php-5.0.0b1/ext/standard/tests/aggregation/aggregate_methods.php on line 5 ---- FAILED ================================================================================ 002- mixing 002+ 003- 100 003+ Fatal error: Call to undefined function: aggregate_methods() in /root/php5/php-5.0.0b1/ext/standard/tests/aggregation/aggregate_methods.php on line 5 004- simple,mix_it 005- simple_prop 006- mixing ================================================================================ ================================================================================ /root/php5/php-5.0.0b1/ext/standard/tests/aggregation/aggregate_methods_by_list.phpt ================================================================================ ---- EXPECTED OUTPUT I'm alive! simple,just_another_method I'm alive! simple,do_this,do_that yep, that's me ---- ACTUAL OUTPUT I'm alive! Fatal error: Call to undefined function: aggregate_methods_by_list() in /root/php5/php-5.0.0b1/ext/standard/tests/aggregation/aggregate_methods_by_list.php on line 5 ---- FAILED ================================================================================ 002- simple,just_another_method 002+ 003- I'm alive! 003+ Fatal error: Call to undefined function: aggregate_methods_by_list() in /root/php5/php-5.0.0b1/ext/standard/tests/aggregation/aggregate_methods_by_list.php on line 5 004- simple,do_this,do_that 005- yep, that's me ================================================================================ ================================================================================ /root/php5/php-5.0.0b1/ext/standard/tests/aggregation/aggregate_methods_by_regexp.phpt ================================================================================ ---- EXPECTED OUTPUT I'm alive! simple,do_this,do_that I'm alive! simple,just_another_method ---- ACTUAL OUTPUT I'm alive! Fatal error: Call to undefined function: aggregate_methods_by_regexp() in /root/php5/php-5.0.0b1/ext/standard/tests/aggregation/aggregate_methods_by_regexp.php on line 5 ---- FAILED ================================================================================ 002- simple,do_this,do_that 002+ 003- I'm alive! 003+ Fatal error: Call to undefined function: aggregate_methods_by_regexp() in /root/php5/php-5.0.0b1/ext/standard/tests/aggregation/aggregate_methods_by_regexp.php on line 5 004- simple,just_another_method ================================================================================ ================================================================================ /root/php5/php-5.0.0b1/ext/standard/tests/aggregation/aggregate_properties.phpt ================================================================================ ---- EXPECTED OUTPUT I'm alive! simple_prop,mix 100 simple ---- ACTUAL OUTPUT I'm alive! Fatal error: Call to undefined function: aggregate_properties() in /root/php5/php-5.0.0b1/ext/standard/tests/aggregation/aggregate_properties.php on line 5 ---- FAILED ================================================================================ 002- simple_prop,mix 002+ 003- 100 003+ Fatal error: Call to undefined function: aggregate_properties() in /root/php5/php-5.0.0b1/ext/standard/tests/aggregation/aggregate_properties.php on line 5 004- simple ================================================================================ ================================================================================ /root/php5/php-5.0.0b1/ext/standard/tests/aggregation/aggregate_properties_by_list.phpt ================================================================================ ---- EXPECTED OUTPUT I'm alive! simple_prop,my_prop,our_prop I'm alive! simple_prop,your_prop,our_prop ---- ACTUAL OUTPUT I'm alive! Fatal error: Call to undefined function: aggregate_properties_by_list() in /root/php5/php-5.0.0b1/ext/standard/tests/aggregation/aggregate_properties_by_list.php on line 5 ---- FAILED ================================================================================ 002- simple_prop,my_prop,our_prop 002+ 003- I'm alive! 003+ Fatal error: Call to undefined function: aggregate_properties_by_list() in /root/php5/php-5.0.0b1/ext/standard/tests/aggregation/aggregate_properties_by_list.php on line 5 004- simple_prop,your_prop,our_prop ================================================================================ ================================================================================ /root/php5/php-5.0.0b1/ext/standard/tests/aggregation/aggregation_info.phpt ================================================================================ ---- EXPECTED OUTPUT I'm alive! Array ( [mixin] => Array ( [methods] => Array ( [0] => mix_it ) [properties] => Array ( [0] => mix ) ) ) ---- ACTUAL OUTPUT I'm alive! Fatal error: Call to undefined function: aggregate() in /root/php5/php-5.0.0b1/ext/standard/tests/aggregation/aggregation_info.php on line 5 ---- FAILED ================================================================================ 002- Array 002+ 003- ( 003+ Fatal error: Call to undefined function: aggregate() in /root/php5/php-5.0.0b1/ext/standard/tests/aggregation/aggregation_info.php on line 5 004- [mixin] => Array 005- ( 006- [methods] => Array 007- ( 008- [0] => mix_it 009- ) 010- 011- [properties] => Array 012- ( 013- [0] => mix 014- ) 015- 016- ) 017- 018- ) ================================================================================ ================================================================================ /root/php5/php-5.0.0b1/ext/standard/tests/aggregation/deaggregate.phpt ================================================================================ ---- EXPECTED OUTPUT I'm alive! Array ( [helper] => Array ( [methods] => Array ( [0] => do_this [1] => do_that [2] => just_another_method ) [properties] => Array ( [0] => my_prop [1] => your_prop [2] => our_prop ) ) [mixin] => Array ( [methods] => Array ( [0] => mix_it ) [properties] => Array ( [0] => mix ) ) ) Array ( [mixin] => Array ( [methods] => Array ( [0] => mix_it ) [properties] => Array ( [0] => mix ) ) ) bool(false) ---- ACTUAL OUTPUT I'm alive! Fatal error: Call to undefined function: aggregate() in /root/php5/php-5.0.0b1/ext/standard/tests/aggregation/deaggregate.php on line 5 ---- FAILED ================================================================================ 002- Array 002+ 003- ( 003+ Fatal error: Call to undefined function: aggregate() in /root/php5/php-5.0.0b1/ext/standard/tests/aggregation/deaggregate.php on line 5 004- [helper] => Array 005- ( 006- [methods] => Array 007- ( 008- [0] => do_this 009- [1] => do_that 010- [2] => just_another_method 011- ) 012- 013- [properties] => Array 014- ( 015- [0] => my_prop 016- [1] => your_prop 017- [2] => our_prop 018- ) 019- 020- ) 021- 022- [mixin] => Array 023- ( 024- [methods] => Array 025- ( 026- [0] => mix_it 027- ) 028- 029- [properties] => Array 030- ( 031- [0] => mix 032- ) 033- 034- ) 035- 036- ) 037- Array 038- ( 039- [mixin] => Array 040- ( 041- [methods] => Array 042- ( 043- [0] => mix_it 044- ) 045- 046- [properties] => Array 047- ( 048- [0] => mix 049- ) 050- 051- ) 052- 053- ) 054- bool(false) ================================================================================ ================================================================================ /root/php5/php-5.0.0b1/ext/standard/tests/general_functions/sunfuncts.phpt ================================================================================ ---- EXPECTED OUTPUT 1041293199 06:39 6.6524557618962 1041293806 16:46 16.769374867459 1043971592 06:32 6.5453702926602 1043972233 17:13 17.217524708736 1046390766 06:06 6.1156526756851 1046391456 17:36 17.6108549623 1049069128 05:28 5.4727420290691 1049069878 17:58 17.972552584375 1051661094 04:54 4.9012299828593 1051661898 18:18 18.313688769483 1054339474 04:34 4.5744292894498 1054340319 18:39 18.656400943241 1056931476 04:36 4.6161204505189 1056932328 18:48 18.808871657766 1059609894 04:54 4.9068825098365 1059610715 18:35 18.599286002028 1062288314 05:14 5.2368895570738 1062289083 18:03 18.060541787879 1064880332 05:32 5.542366581139 1064881044 17:24 17.411505614917 1067558754 05:54 5.9162088420581 1067559410 16:50 16.833698570628 1070150780 06:20 6.3462215520697 1070151395 16:35 16.583589055537 ---- ACTUAL OUTPUT 1041293199 06:39 6.6524557618962 1041293806 16:46 16.769374867459 1043971592 06:32 6.5453702926602 1043972233 17:13 17.217524708736 1046390766 06:06 6.1156526756851 1046391456 17:36 17.6108549623 1049069128 05:28 5.4727420290691 1049069878 17:58 17.972552584375 1051661094 04:54 4.9012299828593 1051661898 18:18 18.313688769483 1054339474 04:34 4.5744292894498 1054340319 18:39 18.656400943241 1056931476 04:36 4.6161204505189 1056932328 18:48 18.808871657766 1059609894 04:54 4.9068825098364 1059610715 18:35 18.599286002028 1062288314 05:14 5.2368895570738 1062289083 18:03 18.060541787879 1064880332 05:32 5.542366581139 1064881044 17:24 17.411505614917 1067558754 05:54 5.9162088420581 1067559410 16:50 16.833698570628 1070150780 06:20 6.3462215520697 1070151395 16:35 16.583589055537 ---- FAILED ================================================================================ 015- 1059609894 04:54 4.9068825098365 015+ 1059609894 04:54 4.9068825098364 ================================================================================ ================================================================================ /root/php5/php-5.0.0b1/ext/xml/tests/xml001.phpt ================================================================================ ---- EXPECTED OUTPUT {?[<?xml version="1.0" encoding="ISO-8859-1"?>]}{?[ ]}{?[<!DOCTYPE]}{?[ ]}{?[phptest]}{?[ ]}{?[SYSTEM]}{?[ ]}{?["notfound.dtd"]}{?[ ]}{?[[]}{?[ ]}{?[<!ENTITY]}{?[ ]}{?[%]}{?[ ]}{?[incent]}{?[ ]}{?[SYSTEM]}{?[ ]}{?["inc.ent"]}{?[>]}{?[ ]}{?[%incent;]}{?[ ]}{?[]]}{?[>]}{?[ ]}{ROOT ID="elem1"}{CDATA[ ]}{CDATA[ Plain text.]}{CDATA[ ]}{CDATA[ ]}{ELEM1}{CDATA[ ]}{CDATA[ ]}{?[<!-- comment -->]}{CDATA[ ]}{CDATA[ ]}{ELEM2}{CDATA[ ]}{CDATA[ ]}{?[<![CDATA[]}{CDATA[CDATA block]}{?[]]>]}{CDATA[ ]}{CDATA[ ]}{ELEM3}{CDATA[ ]}{CDATA[ ]}{ENTREF[&included-entity;]}{CDATA[ ]}{CDATA[ ]}{ELEM4}{CDATA[ ]}{CDATA[ ]}{PI[test,processing instruction ]}{CDATA[ ]}{CDATA[ ]}{/ELEM4}{CDATA[ ]}{CDATA[ ]}{/ELEM3}{CDATA[ ]}{CDATA[ ]}{/ELEM2}{CDATA[ ]}{CDATA[ ]}{/ELEM1}{CDATA[ ]}{/ROOT}{?[ ]}parse complete ---- ACTUAL OUTPUT {EXTENTREF[incent,,,inc.ent]} {ROOT ID="elem1"}{CDATA[ Plain text. ]}{ELEM1}{CDATA[ ]}{?[<-- comment -->]}{CDATA[ ]}{ELEM2}{CDATA[ ]}{CDATA[ ]}{ELEM3}{CDATA[ ]}{ENTREF[&included-entity;]}{CDATA[ ]}{ELEM4}{CDATA[ ]}{PI[test,processing instruction ]}{CDATA[ ]}{/ELEM4}{CDATA[ ]}{/ELEM3}{CDATA[ ]}{/ELEM2}{CDATA[ ]}{/ELEM1}{CDATA[ ]}{/ROOT}XML error: Undeclared entity warning at line 21 ---- FAILED ================================================================================ 001- {?[<?xml version="1.0" encoding="ISO-8859-1"?>]}{?[ 001+ {EXTENTREF[incent,,,inc.ent]} 002- ]}{?[<!DOCTYPE]}{?[ ]}{?[phptest]}{?[ ]}{?[SYSTEM]}{?[ ]}{?["notfound.dtd"]}{?[ ]}{?[[]}{?[ 002+ {ROOT ID="elem1"}{CDATA[ 003- ]}{?[<!ENTITY]}{?[ ]}{?[%]}{?[ ]}{?[incent]}{?[ ]}{?[SYSTEM]}{?[ ]}{?["inc.ent"]}{?[>]}{?[ 003+ Plain text. 004- ]}{?[%incent;]}{?[ 004+ ]}{ELEM1}{CDATA[ 005- ]}{?[]]}{?[>]}{?[ 005+ ]}{?[<-- comment -->]}{CDATA[ 006- ]}{ROOT ID="elem1"}{CDATA[ 006+ ]}{ELEM2}{CDATA[ 007- ]}{CDATA[ Plain text.]}{CDATA[ 007+ ]}{CDATA[ 008- ]}{CDATA[ ]}{ELEM1}{CDATA[ 008+ ]}{ELEM3}{CDATA[ 009- ]}{CDATA[ ]}{?[<!-- comment -->]}{CDATA[ 009+ ]}{ENTREF[&included-entity;]}{CDATA[ 010- ]}{CDATA[ ]}{ELEM2}{CDATA[ 010+ ]}{ELEM4}{CDATA[ 011- ]}{CDATA[ ]}{?[<![CDATA[]}{CDATA[CDATA block]}{?[]]>]}{CDATA[ 011+ ]}{PI[test,processing instruction ]}{CDATA[ 012- ]}{CDATA[ ]}{ELEM3}{CDATA[ 012+ ]}{/ELEM4}{CDATA[ 013- ]}{CDATA[ ]}{ENTREF[&included-entity;]}{CDATA[ 013+ ]}{/ELEM3}{CDATA[ 014- ]}{CDATA[ ]}{ELEM4}{CDATA[ 014+ ]}{/ELEM2}{CDATA[ 015- ]}{CDATA[ ]}{PI[test,processing instruction ]}{CDATA[ 015+ ]}{/ELEM1}{CDATA[ 016- ]}{CDATA[ ]}{/ELEM4}{CDATA[ 016+ ]}{/ROOT}XML error: Undeclared entity warning at line 21 017- ]}{CDATA[ ]}{/ELEM3}{CDATA[ 018- ]}{CDATA[ ]}{/ELEM2}{CDATA[ 019- ]}{CDATA[ ]}{/ELEM1}{CDATA[ 020- ]}{/ROOT}{?[ 021- ]}parse complete ================================================================================ ================================================================================ /root/php5/php-5.0.0b1/ext/xml/tests/xml002.phpt ================================================================================ ---- EXPECTED OUTPUT {?[<?xml version="1.0" encoding="ISO-8859-1"?>]}{?[ ]}{?[<!DOCTYPE]}{?[ ]}{?[phptest]}{?[ ]}{?[SYSTEM]}{?[ ]}{?["notfound.dtd"]}{?[ ]}{?[[]}{?[ ]}{?[<!ENTITY]}{?[ ]}{?[%]}{?[ ]}{?[incent]}{?[ ]}{?[SYSTEM]}{?[ ]}{?["inc.ent"]}{?[>]}{?[ ]}{?[%incent;]}{?[ ]}{?[]]}{?[>]}{?[ ]}{ROOT ID="elem1"}{CDATA[ ]}{CDATA[ Plain text.]}{CDATA[ ]}{CDATA[ ]}{ELEM1}{CDATA[ ]}{CDATA[ ]}{?[<!-- comment -->]}{CDATA[ ]}{CDATA[ ]}{ELEM2}{CDATA[ ]}{CDATA[ ]}{?[<![CDATA[]}{CDATA[CDATA block]}{?[]]>]}{CDATA[ ]}{CDATA[ ]}{ELEM3}{CDATA[ ]}{CDATA[ ]}{ENTREF[&included-entity;]}{CDATA[ ]}{CDATA[ ]}{ELEM4}{CDATA[ ]}{CDATA[ ]}{PI[test,processing instruction ]}{CDATA[ ]}{CDATA[ ]}{/ELEM4}{CDATA[ ]}{CDATA[ ]}{/ELEM3}{CDATA[ ]}{CDATA[ ]}{/ELEM2}{CDATA[ ]}{CDATA[ ]}{/ELEM1}{CDATA[ ]}{/ROOT}{?[ ]}parse complete ---- ACTUAL OUTPUT {EXTENTREF[incent,,,inc.ent]} {ROOT ID="elem1"}{CDATA[ Plain text. ]}{ELEM1}{CDATA[ ]}{?[<-- comment -->]}{CDATA[ ]}{ELEM2}{CDATA[ ]}{CDATA[ ]}{ELEM3}{CDATA[ ]}{ENTREF[&included-entity;]}{CDATA[ ]}{ELEM4}{CDATA[ ]}{PI[test,processing instruction ]}{CDATA[ ]}{/ELEM4}{CDATA[ ]}{/ELEM3}{CDATA[ ]}{/ELEM2}{CDATA[ ]}{/ELEM1}{CDATA[ ]}{/ROOT}XML error: Undeclared entity warning at line 21 ---- FAILED ================================================================================ 001- {?[<?xml version="1.0" encoding="ISO-8859-1"?>]}{?[ 001+ {EXTENTREF[incent,,,inc.ent]} 002- ]}{?[<!DOCTYPE]}{?[ ]}{?[phptest]}{?[ ]}{?[SYSTEM]}{?[ ]}{?["notfound.dtd"]}{?[ ]}{?[[]}{?[ 002+ {ROOT ID="elem1"}{CDATA[ 003- ]}{?[<!ENTITY]}{?[ ]}{?[%]}{?[ ]}{?[incent]}{?[ ]}{?[SYSTEM]}{?[ ]}{?["inc.ent"]}{?[>]}{?[ 003+ Plain text. 004- ]}{?[%incent;]}{?[ 004+ ]}{ELEM1}{CDATA[ 005- ]}{?[]]}{?[>]}{?[ 005+ ]}{?[<-- comment -->]}{CDATA[ 006- ]}{ROOT ID="elem1"}{CDATA[ 006+ ]}{ELEM2}{CDATA[ 007- ]}{CDATA[ Plain text.]}{CDATA[ 007+ ]}{CDATA[ 008- ]}{CDATA[ ]}{ELEM1}{CDATA[ 008+ ]}{ELEM3}{CDATA[ 009- ]}{CDATA[ ]}{?[<!-- comment -->]}{CDATA[ 009+ ]}{ENTREF[&included-entity;]}{CDATA[ 010- ]}{CDATA[ ]}{ELEM2}{CDATA[ 010+ ]}{ELEM4}{CDATA[ 011- ]}{CDATA[ ]}{?[<![CDATA[]}{CDATA[CDATA block]}{?[]]>]}{CDATA[ 011+ ]}{PI[test,processing instruction ]}{CDATA[ 012- ]}{CDATA[ ]}{ELEM3}{CDATA[ 012+ ]}{/ELEM4}{CDATA[ 013- ]}{CDATA[ ]}{ENTREF[&included-entity;]}{CDATA[ 013+ ]}{/ELEM3}{CDATA[ 014- ]}{CDATA[ ]}{ELEM4}{CDATA[ 014+ ]}{/ELEM2}{CDATA[ 015- ]}{CDATA[ ]}{PI[test,processing instruction ]}{CDATA[ 015+ ]}{/ELEM1}{CDATA[ 016- ]}{CDATA[ ]}{/ELEM4}{CDATA[ 016+ ]}{/ROOT}XML error: Undeclared entity warning at line 21 017- ]}{CDATA[ ]}{/ELEM3}{CDATA[ 018- ]}{CDATA[ ]}{/ELEM2}{CDATA[ 019- ]}{CDATA[ ]}{/ELEM1}{CDATA[ 020- ]}{/ROOT}{?[ 021- ]}parse complete ================================================================================ ================================================================================ /root/php5/php-5.0.0b1/ext/xml/tests/xml003.phpt ================================================================================ ---- EXPECTED OUTPUT {?[<?xml version="1.0" encoding="ISO-8859-1"?>]}{?[ ]}{?[<!DOCTYPE]}{?[ ]}{?[phptest]}{?[ ]}{?[SYSTEM]}{?[ ]}{?["notfound.dtd"]}{?[ ]}{?[[]}{?[ ]}{?[<!ENTITY]}{?[ ]}{?[%]}{?[ ]}{?[incent]}{?[ ]}{?[SYSTEM]}{?[ ]}{?["inc.ent"]}{?[>]}{?[ ]}{?[%incent;]}{?[ ]}{?[]]}{?[>]}{?[ ]}{ROOT ID="elem1"}{CDATA[ ]}{CDATA[ Plain text.]}{CDATA[ ]}{CDATA[ ]}{ELEM1}{CDATA[ ]}{CDATA[ ]}{?[<!-- comment -->]}{CDATA[ ]}{CDATA[ ]}{ELEM2}{CDATA[ ]}{CDATA[ ]}{?[<![CDATA[]}{CDATA[CDATA block]}{?[]]>]}{CDATA[ ]}{CDATA[ ]}{ELEM3}{CDATA[ ]}{CDATA[ ]}{ENTREF[&included-entity;]}{CDATA[ ]}{CDATA[ ]}{ELEM4}{CDATA[ ]}{CDATA[ ]}{PI[test,processing instruction ]}{CDATA[ ]}{CDATA[ ]}{/ELEM4}{CDATA[ ]}{CDATA[ ]}{/ELEM3}{CDATA[ ]}{CDATA[ ]}{/ELEM2}{CDATA[ ]}{CDATA[ ]}{/ELEM1}{CDATA[ ]}{/ROOT}{?[ ]}parse complete ---- ACTUAL OUTPUT {EXTENTREF[incent,,,inc.ent]} {ROOT ID="elem1"}{CDATA[ Plain text. ]}{ELEM1}{CDATA[ ]}{?[<-- comment -->]}{CDATA[ ]}{ELEM2}{CDATA[ ]}{CDATA[ ]}{ELEM3}{CDATA[ ]}{ENTREF[&included-entity;]}{CDATA[ ]}{ELEM4}{CDATA[ ]}{PI[test,processing instruction ]}{CDATA[ ]}{/ELEM4}{CDATA[ ]}{/ELEM3}{CDATA[ ]}{/ELEM2}{CDATA[ ]}{/ELEM1}{CDATA[ ]}{/ROOT}XML error: Undeclared entity warning at line 21 ---- FAILED ================================================================================ 001- {?[<?xml version="1.0" encoding="ISO-8859-1"?>]}{?[ 001+ {EXTENTREF[incent,,,inc.ent]} 002- ]}{?[<!DOCTYPE]}{?[ ]}{?[phptest]}{?[ ]}{?[SYSTEM]}{?[ ]}{?["notfound.dtd"]}{?[ ]}{?[[]}{?[ 002+ {ROOT ID="elem1"}{CDATA[ 003- ]}{?[<!ENTITY]}{?[ ]}{?[%]}{?[ ]}{?[incent]}{?[ ]}{?[SYSTEM]}{?[ ]}{?["inc.ent"]}{?[>]}{?[ 003+ Plain text. 004- ]}{?[%incent;]}{?[ 004+ ]}{ELEM1}{CDATA[ 005- ]}{?[]]}{?[>]}{?[ 005+ ]}{?[<-- comment -->]}{CDATA[ 006- ]}{ROOT ID="elem1"}{CDATA[ 006+ ]}{ELEM2}{CDATA[ 007- ]}{CDATA[ Plain text.]}{CDATA[ 007+ ]}{CDATA[ 008- ]}{CDATA[ ]}{ELEM1}{CDATA[ 008+ ]}{ELEM3}{CDATA[ 009- ]}{CDATA[ ]}{?[<!-- comment -->]}{CDATA[ 009+ ]}{ENTREF[&included-entity;]}{CDATA[ 010- ]}{CDATA[ ]}{ELEM2}{CDATA[ 010+ ]}{ELEM4}{CDATA[ 011- ]}{CDATA[ ]}{?[<![CDATA[]}{CDATA[CDATA block]}{?[]]>]}{CDATA[ 011+ ]}{PI[test,processing instruction ]}{CDATA[ 012- ]}{CDATA[ ]}{ELEM3}{CDATA[ 012+ ]}{/ELEM4}{CDATA[ 013- ]}{CDATA[ ]}{ENTREF[&included-entity;]}{CDATA[ 013+ ]}{/ELEM3}{CDATA[ 014- ]}{CDATA[ ]}{ELEM4}{CDATA[ 014+ ]}{/ELEM2}{CDATA[ 015- ]}{CDATA[ ]}{PI[test,processing instruction ]}{CDATA[ 015+ ]}{/ELEM1}{CDATA[ 016- ]}{CDATA[ ]}{/ELEM4}{CDATA[ 016+ ]}{/ROOT}XML error: Undeclared entity warning at line 21 017- ]}{CDATA[ ]}{/ELEM3}{CDATA[ 018- ]}{CDATA[ ]}{/ELEM2}{CDATA[ 019- ]}{CDATA[ ]}{/ELEM1}{CDATA[ 020- ]}{/ROOT}{?[ 021- ]}parse complete ================================================================================ ================================================================================ BUILD ENVIRONMENT ================================================================================ OS: Linux - Linux lnx 2.4.18-18.7.x #1 Wed Nov 13 19:05:27 EST 2002 i686 Automake: automake (GNU automake) 1.4-p5 Copyright (C) 1999, 2001 Free Software Foundation, Inc. This is free software; see the source for copying conditions. There is NO warranty; not even for MERCHANTABILITY or FITNESS FOR A PARTICULAR PURPOSE. Written by Tom Tromey <tromey@cygnus.com> Autoconf: Autoconf version 2.13 Libtool: ltmain.sh (GNU libtool) 1.4.3 (1.922.2.110 2002/10/23 01:39:54) Compiler: Reading specs from /usr/lib/gcc-lib/i386-redhat-linux/2.96/specs gcc version 2.96 20000731 (Red Hat Linux 7.3 2.96-113) Bison: bison (GNU Bison) 1.35 Copyright 1984, 1986, 1989, 1992, 2000, 2001, 2002 Free Software Foundation, Inc. This is free software; see the source for copying conditions. There is NO warranty; not even for MERCHANTABILITY or FITNESS FOR A PARTICULAR PURPOSE. Libraries: libcrypt.so.1 => /lib/libcrypt.so.1 (0x4001c000) libexpat.so.0 => /usr/local/lib/libexpat.so.0 (0x4004a000) libmm.so.11 => /usr/lib/libmm.so.11 (0x40069000) libpq.so.2 => /usr/lib/libpq.so.2 (0x4006e000) libpdf.so.1 => /usr/local/lib/libpdf.so.1 (0x40080000) libm.so.6 => /lib/i686/libm.so.6 (0x4010f000) libz.so.1 => /usr/lib/libz.so.1 (0x40131000) libpng.so.2 => /usr/lib/libpng.so.2 (0x40140000) libmysqlclient.so.10 => /usr/lib/mysql/libmysqlclient.so.10 (0x40162000) libming.so => /usr/lib/libming.so (0x40198000) libgmp.so.3 => /usr/lib/libgmp.so.3 (0x401d6000) libjpeg.so.62 => /usr/lib/libjpeg.so.62 (0x401fe000) libbz2.so.1 => /usr/lib/libbz2.so.1 (0x4021c000) libresolv.so.2 => /lib/libresolv.so.2 (0x4022d000) libnsl.so.1 => /lib/libnsl.so.1 (0x4023e000) libodbc.so.1 => /usr/local/lib/libodbc.so.1 (0x40253000) libdl.so.2 => /lib/libdl.so.2 (0x402b1000) libxml2.so.2 => /usr/lib/libxml2.so.2 (0x402b4000) libpthread.so.0 => /lib/i686/libpthread.so.0 (0x403a1000) libc.so.6 => /lib/i686/libc.so.6 (0x42000000) libssl.so.2 => /lib/libssl.so.2 (0x403b6000) libcrypto.so.2 => /lib/libcrypto.so.2 (0x403e3000) libkrb5.so.3 => /usr/kerberos/lib/libkrb5.so.3 (0x404a7000) libk5crypto.so.3 => /usr/kerberos/lib/libk5crypto.so.3 (0x404fe000) libcom_err.so.3 => /usr/kerberos/lib/libcom_err.so.3 (0x4050e000) /lib/ld-linux.so.2 => /lib/ld-linux.so.2 (0x40000000) User's E-mail: eero at jlug dot org ================================================================================ PHPINFO ================================================================================ phpinfo() PHP Version => 5.0.0b1 System => Linux lnx 2.4.18-18.7.x #1 Wed Nov 13 19:05:27 EST 2002 i686 Build Date => Jun 30 2003 14:08:10 Configure Command => './configure' '--with-mysql' '--with-bz2' '--with-gd' '--with-jpeg-dir=/usr/lib' '--with-png-dir=/usr/lib' '--with-gettext' '--with-apxs=/home/apache/bin/apxs' '--with-pgsql' '--with-zlib-dir=/usr/lib' '--enable-ftp' '--enable-sockets' '--with-ming' '--with-mm' '--with-pdflib' '--enable-mime-magic' '--enable-dio' '--enable-calendar' '--enable-bcmath' '--enable-wddx' '--with-xmlrpc' '--with-expat' '--with-dom' '--with-unixODBC' '--with-freetype' '--enable-gd-native-ttf' '--with-gettext' '--with-gmp' '--enable-mbstring' '--enable-mbregex' '--enable-xslt' '--with-xslt-sablot' '--with-sablot-js' '--enable-shmop' Server API => Command Line Interface Virtual Directory Support => disabled Configuration File (php.ini) Path => /usr/local/lib/php.ini PHP API => 20030518 PHP Extension => 20020429 Zend Extension => 90021012 Debug Build => no Thread Safety => disabled Registered PHP Streams => php, http, ftp, compress.bzip2, compress.zlib This program makes use of the Zend Scripting Language Engine: Zend Engine v2.0.0-dev, Copyright (c) 1998-2003 Zend Technologies _______________________________________________________________________ Configuration PHP Core Directive => Local Value => Master Value allow_call_time_pass_reference => On => On allow_url_fopen => On => On always_populate_raw_post_data => Off => Off arg_separator.input => & => & arg_separator.output => & => & asp_tags => Off => Off auto_append_file => no value => no value auto_prepend_file => no value => no value browscap => no value => no value default_charset => no value => no value default_mimetype => text/html => text/html define_syslog_variables => Off => Off disable_classes => no value => no value disable_functions => no value => no value display_errors => On => On display_startup_errors => Off => Off doc_root => no value => no value docref_ext => no value => no value docref_root => no value => no value enable_dl => On => On error_append_string => no value => no value error_log => /home/apache/logs/php.log => /home/apache/logs/php.log error_prepend_string => no value => no value error_reporting => 2039 => 2039 expose_php => On => On extension_dir => ./ => ./ file_uploads => On => On gpc_order => GPC => GPC highlight.bg => #FFFFFF => #FFFFFF highlight.comment => #FF9900 => #FF9900 highlight.default => #0000CC => #0000CC highlight.html => #000000 => #000000 highlight.keyword => #006600 => #006600 highlight.string => #CC0000 => #CC0000 html_errors => On => On ignore_repeated_errors => Off => Off ignore_repeated_source => Off => Off ignore_user_abort => Off => Off implicit_flush => Off => Off include_path => .:/usr/local/lib/php => .:/usr/local/lib/php log_errors => On => On log_errors_max_len => 1024 => 1024 magic_quotes_gpc => On => On magic_quotes_runtime => Off => Off magic_quotes_sybase => Off => Off mail.force_extra_parameters => no value => no value max_execution_time => 30 => 30 max_input_time => -1 => -1 open_basedir => no value => no value output_buffering => 1 => 1 output_handler => no value => no value post_max_size => 8M => 8M precision => 12 => 12 register_argc_argv => On => On register_globals => On => On register_long_arrays => On => On report_memleaks => On => On report_zend_debug => Off => Off safe_mode => Off => Off safe_mode_exec_dir => no value => no value safe_mode_gid => Off => Off safe_mode_include_dir => no value => no value sendmail_from => me@localhost.com => me@localhost.com sendmail_path => /usr/sbin/sendmail -t -i => /usr/sbin/sendmail -t -i serialize_precision => 100 => 100 short_open_tag => On => On SMTP => localhost => localhost smtp_port => 25 => 25 sql.safe_mode => Off => Off track_errors => Off => Off unserialize_callback_func => no value => no value upload_max_filesize => 2M => 2M upload_tmp_dir => no value => no value user_dir => no value => no value variables_order => EGPCS => EGPCS xmlrpc_error_number => 0 => 0 xmlrpc_errors => Off => Off y2k_compliance => Off => Off zend2.implicit_clone => no value => no value bcmath BCMath support => enabled bz2 BZip2 Support => Enabled BZip2 Version => 1.0.2, 30-Dec-2001 calendar Calendar support => enabled ctype ctype functions => enabled dio dio support => enabled dom DOM/XML => enabled DOM/XML API Version => 20030413 libxml Version => 2.5.7 HTML Support => enabled XPath Support => enabled XPointer Support => enabled ftp FTP support => enabled gd GD Support => enabled GD Version => bundled (2.0.15 compatible) GIF Read Support => enabled JPG Support => enabled PNG Support => enabled WBMP Support => enabled XBM Support => enabled gettext GetText Support => enabled gmp gmp support => enabled mbstring Multibyte Support => enabled Japanese support => enabled Multibyte (japanese) regex support => enabled mbstring extension makes use of "streamable kanji code filter and converter", which is distributed under the GNU Lesser General Public License version 2.1. Directive => Local Value => Master Value mbstring.detect_order => no value => no value mbstring.encoding_translation => Off => Off mbstring.func_overload => 0 => 0 mbstring.http_input => pass => pass mbstring.http_output => pass => pass mbstring.internal_encoding => none => none mbstring.language => neutral => neutral mbstring.substitute_character => no value => no value ming Ming SWF output library => enabled Version => 0.2a mysql MySQL Support => enabled Active Persistent Links => 0 Active Links => 0 Client API version => 3.23.56 MYSQL_MODULE_TYPE => external MYSQL_SOCKET => /var/lib/mysql/mysql.sock MYSQL_INCLUDE => -I/usr/include/mysql MYSQL_LIBS => -L/usr/lib/mysql -lmysqlclient Directive => Local Value => Master Value mysql.allow_persistent => On => On mysql.connect_timeout => 60 => 60 mysql.default_host => no value => no value mysql.default_password => no value => no value mysql.default_port => no value => no value mysql.default_socket => no value => no value mysql.default_user => no value => no value mysql.max_links => Unlimited => Unlimited mysql.max_persistent => Unlimited => Unlimited mysql.trace_mode => Off => Off odbc ODBC Support => enabled Active Persistent Links => 0 Active Links => 0 ODBC library => unixODBC ODBC_INCLUDE => -I/usr/local/include ODBC_LFLAGS => -L/usr/local/lib ODBC_LIBS => -lodbc Directive => Local Value => Master Value odbc.allow_persistent => On => On odbc.check_persistent => On => On odbc.default_db => no value => no value odbc.default_pw => <i>no value</i> => <i>no value</i> odbc.default_user => no value => no value odbc.defaultbinmode => return as is => return as is odbc.defaultlrl => return up to 4096 bytes => return up to 4096 bytes odbc.max_links => Unlimited => Unlimited odbc.max_persistent => Unlimited => Unlimited pcre PCRE (Perl Compatible Regular Expressions) Support => enabled PCRE Library Version => 4.3 21-May-2003 pdf PDF Support => enabled PDFlib GmbH Version => 4.0.3 Revision => $Revision: 1.125 $ pgsql PostgreSQL Support => enabled PostgreSQL(libpq) Version => 7.2.3 Multibyte character support => enabled SSL support => enabled Active Persistent Links => 0 Active Links => 0 Directive => Local Value => Master Value pgsql.allow_persistent => On => On pgsql.auto_reset_persistent => Off => Off pgsql.ignore_notice => Off => Off pgsql.log_notice => Off => Off pgsql.max_links => Unlimited => Unlimited pgsql.max_persistent => Unlimited => Unlimited posix Revision => $Revision: 1.56 $ session Session Support => enabled Registered save handlers => files user mm Directive => Local Value => Master Value session.auto_start => Off => Off session.bug_compat_42 => On => On session.bug_compat_warn => On => On session.cache_expire => 180 => 180 session.cache_limiter => nocache => nocache session.cookie_domain => no value => no value session.cookie_lifetime => 0 => 0 session.cookie_path => / => / session.cookie_secure => Off => Off session.entropy_file => no value => no value session.entropy_length => 0 => 0 session.gc_divisor => 100 => 100 session.gc_maxlifetime => 1440 => 1440 session.gc_probability => 1 => 1 session.hash_bits_per_character => 4 => 4 session.hash_function => 0 => 0 session.name => PHPSESSID => PHPSESSID session.referer_check => no value => no value session.save_handler => files => files session.save_path => /tmp => /tmp session.serialize_handler => php => php session.use_cookies => On => On session.use_only_cookies => Off => Off session.use_trans_sid => Off => Off shmop shmop support => enabled simplexml Simplexml support => enabled Revision => $Revision: 1.44 $ sockets Sockets Support => enabled sqlite SQLite support => enabled PECL Module version => 1.1-dev $Id: sqlite.c,v 1.66 2003/06/27 14:30:26 edink Exp $ SQLite Library => 2.8.3 SQLite Encoding => iso8859 Directive => Local Value => Master Value sqlite.assoc_case => 0 => 0 standard Regex Library => Bundled library enabled Dynamic Library Support => enabled Path to sendmail => /usr/sbin/sendmail -t -i Directive => Local Value => Master Value assert.active => 1 => 1 assert.bail => 0 => 0 assert.callback => no value => no value assert.quiet_eval => 0 => 0 assert.warning => 1 => 1 auto_detect_line_endings => 0 => 0 date.default_latitude => 31.7667 => 31.7667 date.default_longitude => 35.2333 => 35.2333 date.sunrise_zenith => 90.83 => 90.83 date.sunset_zenith => 90.83 => 90.83 default_socket_timeout => 60 => 60 safe_mode_allowed_env_vars => PHP_ => PHP_ safe_mode_protected_env_vars => LD_LIBRARY_PATH => LD_LIBRARY_PATH url_rewriter.tags => a=href,area=href,frame=src,input=src,form=fakeentry => a=href,area=href,frame=src,input=src,form=fakeentry user_agent => no value => no value tokenizer Tokenizer Support => enabled wddx WDDX Support => enabled WDDX Session Serializer => enabled xml XML Support => active XML Namespace Support => active libxml2 Version => 2.5.7 xmlrpc core library version => xmlrpc-epi v. 0.51 php extension version => 0.51 author => Dan Libby homepage => http://xmlrpc-epi.sourceforge.net open sourced by => Epinions.com zlib ZLib Support => enabled Compiled Version => 1.1.4 Linked Version => 1.1.4 Directive => Local Value => Master Value zlib.output_compression => Off => Off zlib.output_compression_level => -1 => -1 zlib.output_handler => no value => no value Additional Modules Module Name Environment Variable => Value PWD => /root/php5/php-5.0.0b1 MAKEFLAGS => MFLAGS => HOSTNAME => lnx REDIRECT_STATUS => TEST_PHP_EXECUTABLE => /root/php5/php-5.0.0b1/sapi/cli/php LESSOPEN => |/usr/bin/lesspipe.sh %s CC => gcc LS_COLORS => no=00:fi=00:di=01;34:ln=01;36:pi=40;33:so=01;35:bd=40;33;01:cd=40;33;01:or=01;05;37;41:mi=01;05;37;41:ex=01;32:*.cmd=01;32:*.exe=01;32:*.com=01;32:*.btm=01;32:*.bat=01;32:*.sh=01;32:*.csh=01;32:*.tar=01;31:*.tgz=01;31:*.arj=01;31:*.taz=01;31:*.lzh=01;31:*.zip=01;31:*.z=01;31:*.Z=01;31:*.gz=01;31:*.bz2=01;31:*.bz=01;31:*.tz=01;31:*.rpm=01;31:*.cpio=01;31:*.jpg=01;35:*.gif=01;35:*.bmp=01;35:*.xbm=01;35:*.xpm=01;35:*.png=01;35:*.tif=01;35: USER => root SCRIPT_FILENAME => MAIL => /var/spool/mail/root INPUTRC => /etc/inputrc BASH_ENV => /root/.bashrc PATH_TRANSLATED => LANG => en_US.iso885915 QUERY_STRING => CONTENT_LENGTH => MAKELEVEL => 1 SSH_CLIENT => deleted SHLVL => 3 LOGNAME => root _ => /root/php5/php-5.0.0b1/sapi/cli/php REQUEST_METHOD => SHELL => /bin/sh USERNAME => root TEST_PHP_SRCDIR => /root/php5/php-5.0.0b1 HISTSIZE => 1000 TERM => xterm HOME => /root SSH_AUTH_SOCK => deleted PATH => /bin:/sbin:/usr/bin:/usr/sbin:/usr/local/bin:/usr/local/sbin:/usr/bin/X11:/usr/X11R6/bin:/usr/local/java/j2sdk1.4.1_01/bin:/root/bin:/home/apache/bin SSH_TTY => deleted CONTENT_TYPE => PHP Variables Variable => Value _SERVER["PWD"] => /root/php5/php-5.0.0b1 _SERVER["MAKEFLAGS"] => _SERVER["MFLAGS"] => _SERVER["HOSTNAME"] => lnx _SERVER["REDIRECT_STATUS"] => _SERVER["TEST_PHP_EXECUTABLE"] => /root/php5/php-5.0.0b1/sapi/cli/php _SERVER["LESSOPEN"] => |/usr/bin/lesspipe.sh %s _SERVER["CC"] => gcc _SERVER["LS_COLORS"] => no=00:fi=00:di=01;34:ln=01;36:pi=40;33:so=01;35:bd=40;33;01:cd=40;33;01:or=01;05;37;41:mi=01;05;37;41:ex=01;32:*.cmd=01;32:*.exe=01;32:*.com=01;32:*.btm=01;32:*.bat=01;32:*.sh=01;32:*.csh=01;32:*.tar=01;31:*.tgz=01;31:*.arj=01;31:*.taz=01;31:*.lzh=01;31:*.zip=01;31:*.z=01;31:*.Z=01;31:*.gz=01;31:*.bz2=01;31:*.bz=01;31:*.tz=01;31:*.rpm=01;31:*.cpio=01;31:*.jpg=01;35:*.gif=01;35:*.bmp=01;35:*.xbm=01;35:*.xpm=01;35:*.png=01;35:*.tif=01;35: _SERVER["USER"] => root _SERVER["SCRIPT_FILENAME"] => _SERVER["MAIL"] => /var/spool/mail/root _SERVER["INPUTRC"] => /etc/inputrc _SERVER["BASH_ENV"] => /root/.bashrc _SERVER["PATH_TRANSLATED"] => _SERVER["LANG"] => en_US.iso885915 _SERVER["QUERY_STRING"] => _SERVER["CONTENT_LENGTH"] => _SERVER["MAKELEVEL"] => 1 _SERVER["SSH_CLIENT"] => deleted _SERVER["SHLVL"] => 3 _SERVER["LOGNAME"] => root _SERVER["_"] => /root/php5/php-5.0.0b1/sapi/cli/php _SERVER["REQUEST_METHOD"] => _SERVER["SHELL"] => /bin/sh _SERVER["USERNAME"] => root _SERVER["TEST_PHP_SRCDIR"] =>

« previous php.qa (#14623) next »